{"text_format":"1","workbook":"xlsx","n_sheets":13,"sheets":["Instructions","Summary","Wells & Facilities","Bldgs & Equip","Chemicals","Water Management","Water Treatment","ICM","PostClosure","Mobilization","Unit_Costs","Estimator","Tools"],"not_rendered":{"charts":0,"images":3,"macros":1,"external_links":0,"defined_names":121,"comments":0,"pivot_tables":0},"unopened":[],"bounds":{"document_bytes":16777216,"sheet_cells":100000,"rows_first":2000,"rows_last":500,"rows_between":2000,"halvings":0,"cell_chars":16384,"cell_head_chars":4096},"cells_cut":0,"cells_raw":0,"read":"whole","date_system":"1900"}

{"sheet":"Instructions","index":0,"n_rows":30,"n_cols":8,"rows_kept":30,"cut":false,"hidden":false,"merged":[]}
["Project Name:",null,"Reclaim Model - Overview of Program"]
[null,"Blank                    ","All users are urged to read the Reclaim Model User Manual - Scroll down for overview description of program.",null,null,"","",""]
[null,null,"Important!  Reclaim 7.0 works better with no other excel files open."]
[null,null,"If other excel files are open ignore run time error and proceed"]
["Reclaim Menu",null,"The default Excel menu bar has an additional tab labelled \"Add-Ins\" that provides options specific to the Reclaim Model.",null,null,"","",""]
[null,"Clear","This option deletes all input data, deletes any duplicated elements and blanks out the project name.  It also allows for segregation into land costs vs water costs if required.",null,null,"","",""]
[null,"Duplicate","This option Duplicates components of the project. E.g. if there is more than one Open Pit, use duplicate to add a second Open Pit.  Quantities for the new Open Pit are erased, but the Activities and Cost Codes are carried over from the original Open Pit.  The new Open Pit subtotal is added to the Summary page.",null,null,"","",""]
[null,"Unit Costs","This option opens a window of unit costs to provide easy reference.  NOTE:  the unit cost table has a filter in the 'UNITS' column.   You can select to only see a particular unit (eg km) or multiple units (km and m3) or all units.",null,null,"","",""]
[null,"Print All ","This option prints the Summary Worksheet, Unit Cost Worksheet, and the individual component worksheets having non-zero balances.  Individual worksheets can be printed directly using standard printing methods, such as Ctl - P.",null,null,"","",""]
[null,"Quit","Select Quit to exit the program",null,null,"","",""]
{"$rows_left_out":21}
{"sheet":"Summary","index":1,"n_rows":23,"n_cols":8,"rows_kept":23,"cut":false,"hidden":false,"merged":[]}
[null,"SUMMARY OF COSTS"]
[]
["CAPITAL COSTS","COMPONENT NAME",null,"COST",null,"LAND LIABILITY",null,"WATER LIABILITY"]
["WELLS AND FACILITIES",{"$f":"IF(ISBLANK('Wells & Facilities'!$C$1),\"\",'Wells & Facilities'!$C$1)","v":""},null,{"$f":"RP1Total","v":0},null,{"$f":"RP1LandTotal","v":0},null,{"$f":"RP1WaterTotal","v":0}]
["BUILDINGS AND EQUIPMENT",{"$f":"IF(ISBLANK('Bldgs & Equip'!$C$1),\"\",'Bldgs & Equip'!$C$1)","v":""},null,{"$f":"Bldg1Total","v":1500.0001},null,{"$f":"Bldg1LandTotal","v":1500},null,{"$f":"Bldg1WaterTotal","v":0}]
["CHEMICALS AND CONTAMINATED SOIL MANAGEMENT"," ",null,{"$f":"Chem1Total","v":121000.0001},null,{"$f":"Chem1LandTotal","v":90875},null,{"$f":"Chem1WaterTotal","v":30125}]
["SURFACE AND GROUNDWATER MANAGEMENT",{"$f":"IF(ISBLANK('Water Treatment'!$C$1),\"\",'Water Treatment'!$C$1)","v":""},null,{"$f":"Water1Total","v":15940.400199999998},null,"-",null,{"$f":"Water1Total","v":15940.400199999998}]
["INTERIM CARE AND MAINTENANCE",{"$f":"IF(ISBLANK(ICM!$C$1),\"\",ICM!$C$1)","v":""},null,{"$f":"ICMTotal","v":12350.000099999999},null,"-",null,{"$f":"ICMTotal","v":12350.000099999999}]
[null,"SUBTOTAL: Capital Costs",null,{"$f":"SUM(D4:D8)","v":150790.40050000002},null,{"$f":"SUM(F4:F8)","v":92375},null,{"$f":"SUM(H4:H8)","v":58415.400299999994}]
[null,"PERCENT OF SUBTOTAL ",null,null,null,{"$f":"IF(F9<0.01,0,F9/D9)","v":0.61260530971266958},null,{"$f":"IF(H9<0.01,0,H9/D9)","v":0.38739468896098589}]
{"$rows_left_out":14}
{"sheet":"Wells & Facilities","index":2,"n_rows":20,"n_cols":11,"rows_kept":20,"cut":false,"hidden":false,"merged":[]}
[1,"Wells and Facilities"]
[]
[null,"ACTIVITY/MATERIAL","Notes","Units","Quantity","Cost Code","Unit Cost","Cost","% Land","Land Cost","Water Cost"]
[null,"OBJECTIVE: ABANDONMENT OF WELLS"]
[null,"All wells- Drilled / Cased",null,"m",null,{"$f":"NA()","v":{"$error":"#N/A"}},{"$f":"IF(ISNA(F5),0,INDEX(IF(UPPER(RIGHT(F5,1))=Low,UnitCostLow, IF(UPPER(RIGHT(F5,1))=High,UnitCostHigh,UnitCostSpecified)),MATCH(UPPER(LEFT(F5,LEN(F5)-1)),CostCode,0)))","v":0},{"$f":"G5*E5","v":0},null,{"$f":"H5*I5","v":0},{"$f":"+H5*(1-I5)","v":0}]
[null,"Sweet Well - Completed / Active / Inactive",null,"m",null,{"$f":"NA()","v":{"$error":"#N/A"}},0,0,null,0,0]
[null,"Sour Well (H2S>1%) - Completed / Active / Inactive",null,"m",null,{"$f":"NA()","v":{"$error":"#N/A"}},0,0,null,0,0]
[null,"Vent Flow / Gas Migration",null,null,null,{"$f":"NA()","v":{"$error":"#N/A"}},0,0,null,0,0]
[null,"Additional Completion Zones",null,null,null,{"$f":"NA()","v":{"$error":"#N/A"}},0,0,null,0,0]
[null,"OBJECTIVE: ABANDONMENT OF PRODUCTION FACILITIES"]
{"$rows_left_out":11}
{"sheet":"Bldgs & Equip","index":3,"n_rows":79,"n_cols":11,"rows_kept":79,"cut":false,"hidden":false,"merged":[]}
[1,"Building / Equip Name:",null,null,null,null,"Bldg / Equip #:",1]
[]
[null,"ACTIVITY/MATERIAL","Notes","Units","Quantity","Cost Code","Unit Cost","Cost","% Land","Land Cost","Water Cost"]
[null,"OBJECTIVE: DISPOSE MOBILE EQUIPMENT"]
[null,"Decontaminate and ship off-site",null,"each",null,{"$f":"NA()","v":{"$error":"#N/A"}},{"$f":"IF(ISNA(F5),0,INDEX(IF(UPPER(RIGHT(F5,1))=Low,UnitCostLow, IF(UPPER(RIGHT(F5,1))=High,UnitCostHigh,UnitCostSpecified)),MATCH(UPPER(LEFT(F5,LEN(F5)-1)),CostCode,0)))","v":0},{"$f":"G5*E5","v":0},null,{"$f":"H5*I5","v":0},{"$f":"+H5*(1-I5)","v":0}]
[null,"Decontaminate, dispose on-site",null,"each",null,{"$f":"NA()","v":{"$error":"#N/A"}},{"$f":"IF(ISNA(F6),0,INDEX(IF(UPPER(RIGHT(F6,1))=Low,UnitCostLow, IF(UPPER(RIGHT(F6,1))=High,UnitCostHigh,UnitCostSpecified)),MATCH(UPPER(LEFT(F6,LEN(F6)-1)),CostCode,0)))","v":0},{"$f":"G6*E6","v":0},null,{"$f":"H6*I6","v":0},{"$f":"+H6*(1-I6)","v":0}]
[null,"Other",null,"each",null,{"$f":"NA()","v":{"$error":"#N/A"}},{"$f":"IF(ISNA(F7),0,INDEX(IF(UPPER(RIGHT(F7,1))=Low,UnitCostLow, IF(UPPER(RIGHT(F7,1))=High,UnitCostHigh,UnitCostSpecified)),MATCH(UPPER(LEFT(F7,LEN(F7)-1)),CostCode,0)))","v":0},{"$f":"G7*E7","v":0},null,0,0]
[null,"OBJECTIVE:  BUILDING DECONTAMINATION & HAZ. MATERIAL REMOVAL"]
[null,"Decontaminate, oil, fuel and glycol systems",null,"mandays",null,{"$f":"NA()","v":{"$error":"#N/A"}},{"$f":"IF(ISNA(F9),0,INDEX(IF(UPPER(RIGHT(F9,1))=Low,UnitCostLow, IF(UPPER(RIGHT(F9,1))=High,UnitCostHigh,UnitCostSpecified)),MATCH(UPPER(LEFT(F9,LEN(F9)-1)),CostCode,0)))","v":0},{"$f":"G9*E9","v":0},null,0,0]
[null,"Decontaminate, general ",null,"mandays",null,{"$f":"NA()","v":{"$error":"#N/A"}},{"$f":"IF(ISNA(F10),0,INDEX(IF(UPPER(RIGHT(F10,1))=Low,UnitCostLow, IF(UPPER(RIGHT(F10,1))=High,UnitCostHigh,UnitCostSpecified)),MATCH(UPPER(LEFT(F10,LEN(F10)-1)),CostCode,0)))","v":0},0,null,0,0]
{"$rows_left_out":70}
{"sheet":"Chemicals","index":4,"n_rows":44,"n_cols":11,"rows_kept":44,"cut":false,"hidden":false,"merged":[[2,1,2,7]]}
[1,"Chemicals/Soil Area Name:"]
[]
[null,"Note:         The procedures, equipment and packaging for clean up and removal of chemicals or contaminated soils are highly dependent on the nature of the chemicals and their existing state of containment. Government guidelines should be consulted on an individual chemical basis.  Any estimate made here should be considered very rough unless specific evaluations have been conducted."]
[null,"ACTIVITY/MATERIAL","Notes","Units","Quantity","Cost Code","Unit Cost","Cost","% Land","Land Cost","Water Cost"]
[null,"HAZARDOUS MATERIALS AUDIT"]
[null,"Phase 1 audit",null,"each",null,{"$f":"NA()","v":{"$error":"#N/A"}},{"$f":"IF(ISNA(F6),0,INDEX(IF(UPPER(RIGHT(F6,1))=Low,UnitCostLow, IF(UPPER(RIGHT(F6,1))=High,UnitCostHigh,UnitCostSpecified)),MATCH(UPPER(LEFT(F6,LEN(F6)-1)),CostCode,0)))","v":0},{"$f":"G6*E6","v":0},null,{"$f":"H6*I6","v":0},{"$f":"+H6*(1-I6)","v":0}]
[null,"Phase 2 audit",null,"each",null,{"$f":"NA()","v":{"$error":"#N/A"}},0,{"$f":"G7*E7","v":0},null,{"$f":"H7*I7","v":0},{"$f":"+H7*(1-I7)","v":0}]
[null,"CONSOLIDATE HAZARDOUS MATERIALS FOR REMOVAL"]
[null,"Waste oils",null,"litre",null,{"$f":"NA()","v":{"$error":"#N/A"}},0,{"$f":"G9*E9","v":0},null,{"$f":"H9*I9","v":0},{"$f":"+H9*(1-I9)","v":0}]
[null,"Fuel - Type 1, eg diesel dregs",null,"litre",null,{"$f":"NA()","v":{"$error":"#N/A"}},0,0,null,0,0]
{"$rows_left_out":35}
{"sheet":"Water Management","index":5,"n_rows":55,"n_cols":8,"rows_kept":55,"cut":false,"hidden":false,"merged":[]}
[1,"Capital Expenditures and Short Term Water Treatment identified in 'Instructions' worksheet"]
[]
[null,"ACTIVITY/MATERIAL","Notes","Units","Quantity","Cost Code","Unit Cost","Cost"]
[null,"OBJECTIVE: STABILIZE SEDIMENT PONDS/WATER MANAGEMENT PONDS"]
[null,"Place soil cover",null,"m3",null,{"$f":"NA()","v":{"$error":"#N/A"}},{"$f":"IF(ISNA(F5),0,INDEX(IF(UPPER(RIGHT(F5,1))=Low,UnitCostLow, IF(UPPER(RIGHT(F5,1))=High,UnitCostHigh,UnitCostSpecified)),MATCH(UPPER(LEFT(F5,LEN(F5)-1)),CostCode,0)))","v":0},{"$f":"G5*E5","v":0}]
[null,"Doze & spread excavated material","contour berms - 2000m2","m3",2000,"DSl",{"$f":"IF(ISNA(F6),0,INDEX(IF(UPPER(RIGHT(F6,1))=Low,UnitCostLow, IF(UPPER(RIGHT(F6,1))=High,UnitCostHigh,UnitCostSpecified)),MATCH(UPPER(LEFT(F6,LEN(F6)-1)),CostCode,0)))","v":0.95},{"$f":"G6*E6","v":1900}]
[null,"Vegetate spread material",null,"ha",null,{"$f":"NA()","v":{"$error":"#N/A"}},{"$f":"IF(ISNA(F7),0,INDEX(IF(UPPER(RIGHT(F7,1))=Low,UnitCostLow, IF(UPPER(RIGHT(F7,1))=High,UnitCostHigh,UnitCostSpecified)),MATCH(UPPER(LEFT(F7,LEN(F7)-1)),CostCode,0)))","v":0},{"$f":"G7*E7","v":0}]
[null,"Rip rap in channel base",null,"each",null,{"$f":"NA()","v":{"$error":"#N/A"}},{"$f":"IF(ISNA(F8),0,INDEX(IF(UPPER(RIGHT(F8,1))=Low,UnitCostLow, IF(UPPER(RIGHT(F8,1))=High,UnitCostHigh,UnitCostSpecified)),MATCH(UPPER(LEFT(F8,LEN(F8)-1)),CostCode,0)))","v":0},{"$f":"G8*E8","v":0}]
[null,"Puncture liner ","restore natural drainage - 2 people, 1 day","manhrs",24,"Lab-sl",{"$f":"IF(ISNA(F9),0,INDEX(IF(UPPER(RIGHT(F9,1))=Low,UnitCostLow, IF(UPPER(RIGHT(F9,1))=High,UnitCostHigh,UnitCostSpecified)),MATCH(UPPER(LEFT(F9,LEN(F9)-1)),CostCode,0)))","v":49.6},{"$f":"G9*E9","v":1190.4000000000001}]
[null,"OBJECTIVE: REDIRECT RUNOFF/CONSTRUCT DIVERSION DITCHES"]
{"$rows_left_out":46}
{"sheet":"Water Treatment","index":6,"n_rows":33,"n_cols":8,"rows_kept":33,"cut":false,"hidden":false,"merged":[]}
[1,"Post Closure Water Treatment - Identified as long term/post-closure in 'Instructions' worksheet"]
[]
[null,"ACTIVITY/MATERIAL","Notes","Units","Quantity","Cost Code","Unit Cost","Cost"]
[null,"OBJECTIVE: ADDITION OF REAGENTS TO WTP"]
[null,"H2O2",null,"kg",null,{"$f":"NA()","v":{"$error":"#N/A"}},{"$f":"IF(ISNA(F5),0,INDEX(IF(UPPER(RIGHT(F5,1))=Low,UnitCostLow, IF(UPPER(RIGHT(F5,1))=High,UnitCostHigh,UnitCostSpecified)),MATCH(UPPER(LEFT(F5,LEN(F5)-1)),CostCode,0)))","v":0},{"$f":"G5*E5","v":0}]
[null,"lime",null,"kg",null,{"$f":"NA()","v":{"$error":"#N/A"}},0,0]
[null,"ferric sulphate",null,"kg",null,{"$f":"NA()","v":{"$error":"#N/A"}},0,0]
[null,"ferrous sulphate",null,"kg",null,{"$f":"NA()","v":{"$error":"#N/A"}},0,0]
[null,"flocculents",null,"kg",null,{"$f":"NA()","v":{"$error":"#N/A"}},0,0]
[null,"Other - WTP operation",null,"m3",175,"OTPh",2,350]
{"$rows_left_out":24}
{"sheet":"ICM","index":7,"n_rows":21,"n_cols":8,"rows_kept":21,"cut":false,"hidden":false,"merged":[]}
[1,"Interim Care and Maintenance"]
[]
[null,"ACTIVITY/MATERIAL","Notes","Units","Quantity","Cost Code","Unit Cost","Cost"]
[null,"INTERIM CARE & MAINTENANCE"]
[null,"on-site caretaker",null,"manmonths",null,{"$f":"NA()","v":{"$error":"#N/A"}},{"$f":"IF(ISNA(F5),0,INDEX(IF(UPPER(RIGHT(F5,1))=Low,UnitCostLow, IF(UPPER(RIGHT(F5,1))=High,UnitCostHigh,UnitCostSpecified)),MATCH(UPPER(LEFT(F5,LEN(F5)-1)),CostCode,0)))","v":0},{"$f":"G5*E5","v":0}]
[null,"extra personnel",null,"manmonths",null,{"$f":"NA()","v":{"$error":"#N/A"}},0,0]
[null,"    -electrician",null,"manmonths",null,{"$f":"NA()","v":{"$error":"#N/A"}},{"$f":"IF(ISNA(F7),0,INDEX(IF(UPPER(RIGHT(F7,1))=Low,UnitCostLow, IF(UPPER(RIGHT(F7,1))=High,UnitCostHigh,UnitCostSpecified)),MATCH(UPPER(LEFT(F7,LEN(F7)-1)),CostCode,0)))","v":0},{"$f":"G7*E7","v":0}]
[null,"    -mechanic",null,"manmonths",null,{"$f":"NA()","v":{"$error":"#N/A"}},{"$f":"IF(ISNA(F8),0,INDEX(IF(UPPER(RIGHT(F8,1))=Low,UnitCostLow, IF(UPPER(RIGHT(F8,1))=High,UnitCostHigh,UnitCostSpecified)),MATCH(UPPER(LEFT(F8,LEN(F8)-1)),CostCode,0)))","v":0},{"$f":"G8*E8","v":0}]
[null,"annual fuel",null,"litre",null,{"$f":"NA()","v":{"$error":"#N/A"}},0,0]
[null,"misc. supplies",null,"allow",null,{"$f":"NA()","v":{"$error":"#N/A"}},{"$f":"IF(ISNA(F10),0,INDEX(IF(UPPER(RIGHT(F10,1))=Low,UnitCostLow, IF(UPPER(RIGHT(F10,1))=High,UnitCostHigh,UnitCostSpecified)),MATCH(UPPER(LEFT(F10,LEN(F10)-1)),CostCode,0)))","v":0},{"$f":"G10*E10","v":0}]
{"$rows_left_out":12}
{"sheet":"PostClosure","index":8,"n_rows":31,"n_cols":8,"rows_kept":31,"cut":false,"hidden":false,"merged":[]}
[1,"Post-Closure Monitoring &  Maintenance:"]
[]
[null,"ACTIVITY/MATERIAL","Notes","Units","Quantity","Cost Code","Unit Cost","Cost"]
[null,"OBJECTIVE: MONITORING & INSPECTIONS"]
[null,"Annual geotechnical inspection",null,"each",null,{"$f":"NA()","v":{"$error":"#N/A"}},{"$f":"IF(ISNA(F5),0,INDEX(IF(UPPER(RIGHT(F5,1))=Low,UnitCostLow, IF(UPPER(RIGHT(F5,1))=High,UnitCostHigh,UnitCostSpecified)),MATCH(UPPER(LEFT(F5,LEN(F5)-1)),CostCode,0)))","v":0},{"$f":"G5*E5","v":0}]
[null,"Survey inspection",null,"each",null,{"$f":"NA()","v":{"$error":"#N/A"}},0,0]
[null,"Site water monitoring (AEMP and SNP)",null,"each",null,{"$f":"NA()","v":{"$error":"#N/A"}},{"$f":"IF(ISNA(F7),0,INDEX(IF(UPPER(RIGHT(F7,1))=Low,UnitCostLow, IF(UPPER(RIGHT(F7,1))=High,UnitCostHigh,UnitCostSpecified)),MATCH(UPPER(LEFT(F7,LEN(F7)-1)),CostCode,0)))","v":0},0]
[null,"   - During pit flooding",null,"each",null,{"$f":"NA()","v":{"$error":"#N/A"}},0,0]
[null,"   - Post pit flooding",null,"each",null,{"$f":"NA()","v":{"$error":"#N/A"}},0,0]
[null,"Air Quality Monitoring Program (AQMP)",null,"each",null,{"$f":"NA()","v":{"$error":"#N/A"}},0,0]
{"$rows_left_out":22}
{"sheet":"Mobilization","index":9,"n_rows":58,"n_cols":8,"rows_kept":58,"cut":false,"hidden":false,"merged":[]}
[1,"Mobilization/Demobilization:"]
[]
[null,"ACTIVITY/MATERIAL","Notes","Units","Quantity","Cost Code","Unit Cost","Cost"]
[null,"MOBILIZE HEAVY EQUIPMENT"]
[null,"Excavators",null,"each",null,{"$f":"NA()","v":{"$error":"#N/A"}},{"$f":"IF(ISNA(F5),0,INDEX(IF(UPPER(RIGHT(F5,1))=Low,UnitCostLow, IF(UPPER(RIGHT(F5,1))=High,UnitCostHigh,UnitCostSpecified)),MATCH(UPPER(LEFT(F5,LEN(F5)-1)),CostCode,0)))","v":0},{"$f":"G5*E5","v":0}]
[null,"Dump trucks",null,"each",null,{"$f":"NA()","v":{"$error":"#N/A"}},0,0]
[null,"Dozers",null,"each",null,{"$f":"NA()","v":{"$error":"#N/A"}},0,0]
[null,"Demolition shears",null,"each",null,{"$f":"NA()","v":{"$error":"#N/A"}},0,0]
[null,"Crane",null,"each",null,{"$f":"NA()","v":{"$error":"#N/A"}},0,0]
[null,"Loader",null,"each",null,{"$f":"NA()","v":{"$error":"#N/A"}},0,{"$f":"G10*E10","v":0}]
{"$rows_left_out":49}
{"sheet":"Unit_Costs","index":10,"n_rows":213,"n_cols":12,"rows_kept":213,"cut":false,"hidden":false,"merged":[]}
["Unit Cost Table (for refining unit costs see \"Estimator\" worksheet)"]
[null,null,null,"Filter by unit",null,"",""]
[null,null,null,null,null,"","",""]
["ITEM","Detail",null,"COST CODE","UNITS","LOW $","HIGH $","SPECIFIED $",null,"COMMENTS"]
[null,null,null,null,null,"","",""]
["Accomodation"]
[null,null,null,"ACCM","manday",100,175]
["Buildings - Decontaminate",null,null,null,null,"","",""]
[null,"Asbestos",null,"BDA","m2",25.6,51.2,null,null,"Low: removal of asbestos siding & flooring; High: removal of insulated pipes, friable asbestos"]
["Buildings - Remove",null,null,null,null,"","",""]
{"$rows_left_out":204}
{"sheet":"Estimator","index":11,"n_rows":55,"n_cols":15,"rows_kept":55,"cut":false,"hidden":false,"merged":[]}
[null,"Unit Cost Estimator",null,1,"Equipment Productivity Figures and Graphs have been reproduced from Caterpillar Performance Handbook - Edition 32 "]
[null,"EXCAVATION",null,null,null,null,"HAUL AND DUMPING",null,null,null,null,"SPREADING/DOZING"]
[null,"Productivity",null,null,null,null,"Productivity",null,null,null,null,"Productivity"]
[null,"Machine","Cat 345 B",null,null,null,"Machine","769 rock truck",null,null,null,"Machine","Cat D8"]
[null,"bucket capacity",null,2.4,"m3",null,"truck capacity",null,24,"m3",null,"Estimate production using example curves provided or ",null,600,"m3/hr"]
[null,"fill factor",null,0.75,"%",null,"fill factor",null,0.8,"%",null,"equivalent from other supplier"]
[null,"cycle time",null,45,"seconds",null,null,null,null,null,null,"Correction factors (see table provided)"]
[null,"operator skill",null,0.8,"%",null,"load time",null,6,"min.",null,"      operator skill",null,0.75]
[null,"machine availability",null,0.83,"%",null,"haul distance",null,1.5,"km",null,"      material type, see table",null,0.8]
[null,"altitude adjustment",null,1,"%",null,"average velocity",null,20,"km/hr",null,"      slot dozing",null,1]
{"$rows_left_out":46}
{"sheet":"Tools","index":12,"n_rows":12,"n_cols":12,"rows_kept":12,"cut":false,"hidden":false,"merged":[]}
["The functions in this worksheet serve as a back up in the event that the menu item \"Add-Ins\" is not shown in Excel menu bar"]
[]
[]
[null,null,"Save file before clearing all data"]
[]
[null,null,null,null,null,null,null,null,null,null,null,"These functions duplicate components within worksheet"]
[]
[]
[null,null,"Shows both active worksheet as well as table of Unit Costs in a separate window"]
[]
{"$rows_left_out":2}