{"text_format":"1","workbook":"xlsx","n_sheets":16,"sheets":["Instructions","Summary","UG Mine","Tailings","Rock Pile","Chemicals","Bldgs & Equip","Water Management","Water Treatment","ICM","Mobilization","PostClosure","Open Pit","Unit_Costs","Estimator","Tools"],"not_rendered":{"charts":0,"images":3,"macros":1,"external_links":0,"defined_names":126,"comments":0,"pivot_tables":0},"unopened":[],"bounds":{"document_bytes":16777216,"sheet_cells":100000,"rows_first":2000,"rows_last":500,"rows_between":2000,"halvings":0,"cell_chars":16384,"cell_head_chars":4096},"cells_cut":0,"cells_raw":0,"read":"whole","date_system":"1900"}

{"sheet":"Instructions","index":0,"n_rows":69,"n_cols":8,"rows_kept":69,"cut":false,"hidden":false,"merged":[[58,0,67,1],[32,0,32,1],[33,0,38,1],[39,0,46,1],[47,0,53,1],[54,0,57,1]]}
["Project Name:",null,"Reclaim Model - Overview of Program"]
[null,"Hope Bay - Doris Madrid  ","All users are urged to read the Reclaim Model User Manual - Scroll down for overview description of program.",null,null,"","",""]
[null,null,"Important!  Reclaim 7.0 works better with no other excel files open."]
[null,null,"If other excel files are open ignore run time error and proceed"]
["Reclaim Menu",null,"The default Excel menu bar has an additional tab labelled \"Add-Ins\" that provides options specific to the Reclaim Model.",null,null,"","",""]
[null,"Clear","This option deletes all input data, deletes any duplicated elements and blanks out the project name.  It also allows for segregation into land costs vs water costs if required.",null,null,"","",""]
[null,"Duplicate","This option Duplicates components of the project. E.g. if there is more than one Open Pit, use duplicate to add a second Open Pit.  Quantities for the new Open Pit are erased, but the Activities and Cost Codes are carried over from the original Open Pit.  The new Open Pit subtotal is added to the Summary page.",null,null,"","",""]
[null,"Unit Costs","This option opens a window of unit costs to provide easy reference.  NOTE:  the unit cost table has a filter in the 'UNITS' column.   You can select to only see a particular unit (eg km) or multiple units (km and m3) or all units.",null,null,"","",""]
[null,"Print All ","This option prints the Summary Worksheet, Unit Cost Worksheet, and the individual component worksheets having non-zero balances.  Individual worksheets can be printed directly using standard printing methods, such as Ctl - P.",null,null,"","",""]
[null,"Quit","Select Quit to exit the program",null,null,"","",""]
{"$rows_left_out":60}
{"sheet":"Summary","index":1,"n_rows":30,"n_cols":8,"rows_kept":30,"cut":false,"hidden":false,"merged":[]}
[null,"SUMMARY OF COSTS"]
[]
["CAPITAL COSTS","COMPONENT NAME",null,"COST",null,"LAND LIABILITY",null,"WATER LIABILITY"]
["OPEN PIT",{"$f":"IF(ISBLANK('Open Pit'!$C$1),\"\",'Open Pit'!$C$1)","v":""},null,{"$f":"Pit1Total","v":1E-4},null,{"$f":"Pit1LandTotal","v":0},null,{"$f":"Pit1WaterTotal","v":0}]
["UNDERGROUND MINE",{"$f":"IF(ISBLANK('UG Mine'!$C$1),\"\",'UG Mine'!$C$1)","v":"Doris -Madrid"},null,{"$f":"UG1Total","v":312867.6201},null,{"$f":"UG1LandTotal","v":306350.5},null,{"$f":"UG1WaterTotal","v":6517.12}]
["TAILINGS FACILITY",{"$f":"IF(ISBLANK(Tailings!$C$1),\"\",Tailings!$C$1)","v":"Doris-Madrid Mines"},null,{"$f":"Tailings1Total","v":18850157.950100005},null,{"$f":"Tailings1LandTotal","v":9548828.9750000015},null,{"$f":"Tailings1WaterTotal","v":9301328.9750000015}]
["ROCK PILE",{"$f":"IF(ISBLANK('Rock Pile'!$C$1),\"\",'Rock Pile'!$C$1)","v":"Doris - Madrid"},null,{"$f":"RP1Total","v":290125.5001},null,{"$f":"RP1LandTotal","v":145062.75},null,{"$f":"RP1WaterTotal","v":145062.75}]
["BUILDINGS AND EQUIPMENT",{"$f":"IF(ISBLANK('Bldgs & Equip'!$C$1),\"\",'Bldgs & Equip'!$C$1)","v":"Doris - Madrid "},null,{"$f":"Bldg1Total","v":13677653.157899993},null,{"$f":"Bldg1LandTotal","v":6760409.5325499959},null,{"$f":"Bldg1WaterTotal","v":6917243.6252499959}]
["CHEMICALS AND CONTAMINATED SOIL MANAGEMENT",{"$f":"IF(ISBLANK(Chemicals!$C$1),\"\",Chemicals!$C$1)","v":""},null,{"$f":"Chem1Total","v":3181811.1416999996},null,{"$f":"Chem1LandTotal","v":1513075.5707999999},null,{"$f":"Chem1WaterTotal","v":1668735.5707999999}]
["SURFACE AND GROUNDWATER MANAGEMENT",{"$f":"IF(ISBLANK('Water Treatment'!$C$1),\"\",'Water Treatment'!$C$1)","v":""},null,{"$f":"Water1Total","v":660058.54209999985},null,"-",null,{"$f":"Water1Total","v":660058.54209999985}]
{"$rows_left_out":21}
{"sheet":"UG Mine","index":2,"n_rows":49,"n_cols":13,"rows_kept":49,"cut":false,"hidden":false,"merged":[[22,1,25,1],[28,1,30,1]]}
[1,"Underground Mine Name","Doris -Madrid",null,null,null,"UG Mine #",1]
[]
[null,"ACTIVITY/MATERIAL","Notes","Unit","Qty","Cost Code","Unit Cost","Cost","% Land","Land Cost","Water Cost"]
[null,"CONTROL ACCESS"]
[null,"Fence",null,"m",null,{"$f":"NA()","v":{"$error":"#N/A"}},{"$f":"IF(ISNA(F5),0,INDEX(IF(UPPER(RIGHT(F5,1))=Low,UnitCostLow, IF(UPPER(RIGHT(F5,1))=High,UnitCostHigh,UnitCostSpecified)),MATCH(UPPER(LEFT(F5,LEN(F5)-1)),CostCode,0)))","v":0},{"$f":"G5*E5","v":0},null,{"$f":"H5*I5","v":0},{"$f":"H5*(1-I5)","v":0}]
[null,"Signs","Doris/Madrid South/Madrid North","each",6,"SH",37.08,222.48,1,{"$f":"H6*I6","v":222.48},{"$f":"H6*(1-I6)","v":0}]
[null,"Block roads",null,"m3",null,{"$f":"NA()","v":{"$error":"#N/A"}},0,{"$f":"G7*E7","v":0},null,0,0]
[null,"Berm",null,"m3",null,{"$f":"NA()","v":{"$error":"#N/A"}},0,0,null,0,0]
[null,"Concrete wall in  portals",null,"m3",null,{"$f":"NA()","v":{"$error":"#N/A"}},0,0,null,{"$f":"H9*I9","v":0},{"$f":"H9*(1-I9)","v":0}]
[null,"Backfill portal Doris","DM-012","m3",710,"TMAC",24.53,17416.3,1,17416.3,0,null,"rounded qty"]
{"$rows_left_out":40}
{"sheet":"Tailings","index":3,"n_rows":86,"n_cols":13,"rows_kept":86,"cut":false,"hidden":false,"merged":[[24,1,29,1]]}
[1,"Tailings Impoundment Name:","Doris-Madrid Mines",null,null,null,"Pond #",1]
[]
[null,"ACTIVITY/MATERIAL","Notes","Units","Quantity","Cost Code","Unit Cost","Cost","% Land","Land Cost","Water Cost"]
[null,"CONTROL ACCESS"]
[null,"Fence",null,"m",null,{"$f":"NA()","v":{"$error":"#N/A"}},{"$f":"IF(ISNA(F5),0,INDEX(IF(UPPER(RIGHT(F5,1))=Low,UnitCostLow, IF(UPPER(RIGHT(F5,1))=High,UnitCostHigh,UnitCostSpecified)),MATCH(UPPER(LEFT(F5,LEN(F5)-1)),CostCode,0)))","v":0},{"$f":"G5*E5","v":0},null,{"$f":"H5*I5","v":0},{"$f":"+H5*(1-I5)","v":0}]
[null,"Signs",null,"each",null,{"$f":"NA()","v":{"$error":"#N/A"}},{"$f":"IF(ISNA(F6),0,INDEX(IF(UPPER(RIGHT(F6,1))=Low,UnitCostLow, IF(UPPER(RIGHT(F6,1))=High,UnitCostHigh,UnitCostSpecified)),MATCH(UPPER(LEFT(F6,LEN(F6)-1)),CostCode,0)))","v":0},{"$f":"G6*E6","v":0},null,{"$f":"H6*I6","v":0},{"$f":"+H6*(1-I6)","v":0}]
[null,"Berm",null,"m3",null,{"$f":"NA()","v":{"$error":"#N/A"}},{"$f":"IF(ISNA(F7),0,INDEX(IF(UPPER(RIGHT(F7,1))=Low,UnitCostLow, IF(UPPER(RIGHT(F7,1))=High,UnitCostHigh,UnitCostSpecified)),MATCH(UPPER(LEFT(F7,LEN(F7)-1)),CostCode,0)))","v":0},{"$f":"G7*E7","v":0},null,0,0]
[null,"Block roads",null,"m3",null,{"$f":"NA()","v":{"$error":"#N/A"}},{"$f":"IF(ISNA(F8),0,INDEX(IF(UPPER(RIGHT(F8,1))=Low,UnitCostLow, IF(UPPER(RIGHT(F8,1))=High,UnitCostHigh,UnitCostSpecified)),MATCH(UPPER(LEFT(F8,LEN(F8)-1)),CostCode,0)))","v":0},{"$f":"G8*E8","v":0},null,0,0]
[null,"Other",null,null,null,{"$f":"NA()","v":{"$error":"#N/A"}},{"$f":"IF(ISNA(F9),0,INDEX(IF(UPPER(RIGHT(F9,1))=Low,UnitCostLow, IF(UPPER(RIGHT(F9,1))=High,UnitCostHigh,UnitCostSpecified)),MATCH(UPPER(LEFT(F9,LEN(F9)-1)),CostCode,0)))","v":0},{"$f":"G9*E9","v":0},null,0,0]
[null,"STABILIZE EMBANKMENT(S)"]
{"$rows_left_out":77}
{"sheet":"Rock Pile","index":4,"n_rows":83,"n_cols":14,"rows_kept":83,"cut":false,"hidden":false,"merged":[[45,1,46,1]]}
[1,"Rock Pile Name:","Doris - Madrid"]
[]
[null,"ACTIVITY/MATERIAL","Notes","Units","Quantity","Cost Code","Unit Cost","Cost","% Land","Land Cost","Water Cost"]
[null,"STABILIZE SLOPES"]
[null,"Grade Waste Rock Pile",null,"m3",null,"TMAC",1.23,{"$f":"G5*E5","v":0},0.5,{"$f":"H5*I5","v":0},{"$f":"+H5*(1-I5)","v":0}]
[null,"Grade Overburden ","Roberts Bay Overburden Pile RB-007","m2",14205,"DSl",{"$f":"IF(ISNA(F6),0,INDEX(IF(UPPER(RIGHT(F6,1))=Low,UnitCostLow, IF(UPPER(RIGHT(F6,1))=High,UnitCostHigh,UnitCostSpecified)),MATCH(UPPER(LEFT(F6,LEN(F6)-1)),CostCode,0)))","v":0.95},13494.75,0.5,6747.375,6747.375]
[null,null,"Quarry 2 Overburden Pile Q2-002 (slopes to 3:1)","m2",8785,"TMAC",3.27,{"$f":"G7*E7","v":28726.95},0.5,{"$f":"H7*I7","v":14363.475},{"$f":"+H7*(1-I7)","v":14363.475}]
[null,null,"Quarry 2 Overburden Pile Q2-002 (top)","m2",18440,"DSl",{"$f":"IF(ISNA(F8),0,INDEX(IF(UPPER(RIGHT(F8,1))=Low,UnitCostLow, IF(UPPER(RIGHT(F8,1))=High,UnitCostHigh,UnitCostSpecified)),MATCH(UPPER(LEFT(F8,LEN(F8)-1)),CostCode,0)))","v":0.95},{"$f":"G8*E8","v":17518},0.5,{"$f":"H8*I8","v":8759},{"$f":"+H8*(1-I8)","v":8759},null,"Don’t agree with SRK rate of $0.01","assume a dozer being used."]
[null,null,"Patch Lake Tank Farm  PLA-001 regrade (dozer)","m2",200,"TMAC",1.23,246,0.5,123,123]
[null,null,"Patch Lake Tank Farm  PLA-001 regrade (excavator)","m2",3630,"TMAC",5.5,19965,0.5,9982.5,9982.5]
{"$rows_left_out":74}
{"sheet":"Chemicals","index":5,"n_rows":107,"n_cols":15,"rows_kept":107,"cut":false,"hidden":false,"merged":[[20,12,22,12],[20,1,22,1],[37,1,40,1],[79,1,84,1],[71,1,78,1],[63,1,70,1],[27,1,28,1],[2,1,2,7],[23,1,26,1],[10,1,12,1],[13,1,15,1],[29,1,33,1]]}
[1,"Chemicals/Soil Area Name: Doris - Madrid"]
[]
[null,"Note:         The procedures, equipment and packaging for clean up and removal of chemicals or contaminated soils are highly dependent on the nature of the chemicals and their existing state of containment. Government guidelines should be consulted on an individual chemical basis.  Any estimate made here should be considered very rough unless specific evaluations have been conducted."]
[null,"ACTIVITY/MATERIAL","Notes","Units","Quantity","Cost Code","Unit Cost","Cost","% Land","Land Cost","Water Cost"]
[null,"HAZARDOUS MATERIALS AUDIT"]
[null,"Hazardous materials audit","Not required","allow",null,{"$f":"NA()","v":{"$error":"#N/A"}},25000,{"$f":"G6*E6","v":0},null,{"$f":"H6*I6","v":0},{"$f":"+H6*(1-I6)","v":0}]
[null,"BUILDING DECONTAMINATION & CONSOLIDATION OF HAZARDOUS MATERIALS"]
[null,"Environmental technician/coordinator",null,"mandays",null,{"$f":"NA()","v":{"$error":"#N/A"}},{"$f":"IF(ISNA(F8),0,INDEX(IF(UPPER(RIGHT(F8,1))=Low,UnitCostLow, IF(UPPER(RIGHT(F8,1))=High,UnitCostHigh,UnitCostSpecified)),MATCH(UPPER(LEFT(F8,LEN(F8)-1)),CostCode,0)))","v":0},{"$f":"G8*E8","v":0},null,{"$f":"H8*I8","v":0},{"$f":"+H8*(1-I8)","v":0}]
[null,"Drain residual fuel from tanks","RB-013, RB-002, RB-003, & DM-020","each",{"$f":"2+4+1+5","v":12},"TMAC",265,3180,0.5,1590,1590]
[null,"Drain, clean and crush empty drums","RB-003","each",150,"TMAC",{"$f":"21.04+18.4","v":39.44},{"$f":"G10*E10","v":5916},0.5,{"$f":"H10*I10","v":2958},{"$f":"+H10*(1-I10)","v":2958}]
{"$rows_left_out":98}
{"sheet":"Bldgs & Equip","index":6,"n_rows":348,"n_cols":14,"rows_kept":348,"cut":false,"hidden":false,"merged":[[246,13,247,13],[320,13,323,13],[236,1,237,1],[22,1,25,1],[89,1,90,1],[96,1,97,1],[46,1,54,1],[134,1,138,1],[94,1,95,1],[76,1,78,1],[91,1,93,1],[115,1,116,1],[111,1,114,1],[23,12,25,12],[112,12,114,12],[238,1,243,1],[32,1,39,1],[98,1,110,1],[192,1,198,1],[55,1,60,1],[61,1,75,1],[26,1,31,1],[199,1,201,1],[79,1,88,1],[148,1,156,1],[141,1,147,1],[40,1,45,1],[117,1,131,1],[176,1,186,1],[4,1,5,1],[285,1,287,1],[17,1,21,1],[202,1,205,1],[187,1,191,1],[272,1,274,1],[157,1,160,1],[161,1,167,1],[168,1,175,1],[221,1,225,1],[228,1,235,1],[208,1,212,1],[12,1,16,1],[269,1,271,1],[278,1,281,1],[213,1,218,1],[246,12,247,12],[320,12,323,12],[329,12,331,12],[336,1,339,1],[314,1,315,1],[300,1,313,1],[328,1,331,1],[320,1,327,1],[289,1,299,1],[316,1,318,1],[333,1,334,1],[246,1,247,1]]}
[1,"Building / Equip Name:","Doris - Madrid ",null,null,null,"Bldg / Equip #:",1]
[]
[null,"ACTIVITY/MATERIAL","Notes","Units","Quantity","Cost Code","Unit Cost","Cost","% Land","Land Cost","Water Cost"]
[null,"DISPOSE MOBILE EQUIPMENT"]
[null,"Decontaminate and prepare for off-site","Madrid North Concentrator","allow",1,"TMAC",50000,{"$f":"G5*E5","v":50000},0.5,{"$f":"H5*I5","v":25000},{"$f":"+H5*(1-I5)","v":25000}]
[null,null,"Doris Water Intake Generator","each",1,"TMAC",1370,{"$f":"G6*E6","v":1370},0.5,{"$f":"H6*I6","v":685},{"$f":"+H6*(1-I6)","v":685}]
[null,"Consolidate Electrical Equipment from Pipelines","Madrid South, Madrid North, Doris freshwater and Tialings/Reclaim water pipelines","m2",{"$f":"2860+2680+1600+4065","v":11205},"TMAC",0.56999999999999995,{"$f":"G7*E7","v":6386.8499999999995},0.5,{"$f":"H7*I7","v":3193.4249999999997},{"$f":"+H7*(1-I7)","v":3193.4249999999997},null,"added cost to remove cabling as well ie C3.20","The added cost for the cabling was not necessarily appropriate.  Waste debris clean up rate as used elsewhere has been applied."]
[null,"Relocate Containers to Quarry 3 Landfill","current a large inventor of containers that will no longer go off site","ea",250,"TMAC",204.56,{"$f":"G8*E8","v":51140},0.5,{"$f":"H8*I8","v":25570},{"$f":"+H8*(1-I8)","v":25570},null,"use units C1.08+C4.15 for the haulage and demolition of contianers at landfill","Understand containers are not to remain as is with no breakdown."]
[null,"Relocate Trailers to Quarry 3 Landfill",null,"m3",null,"TMAC",19.149999999999999,{"$f":"G9*E9","v":0},0.5,{"$f":"H9*I9","v":0},{"$f":"+H9*(1-I9)","v":0}]
[null,"Relocate Camp","Windy Accommodation Camp (relocate to Doris)","m3",32,"TMAC",{"$f":"2.77+10.23","v":13},{"$f":"G10*E10","v":416},0.5,{"$f":"H10*I10","v":208},{"$f":"+H10*(1-I10)","v":208},null,"added cost to collapse and containerize"]
{"$rows_left_out":339}
{"sheet":"Water Management","index":7,"n_rows":62,"n_cols":9,"rows_kept":62,"cut":false,"hidden":false,"merged":[]}
[1,"Capital Expenditures and Short Term Water Treatment identified in 'Instructions' worksheet"]
[]
[null,"ACTIVITY/MATERIAL","Notes","Units","Quantity","Cost Code","Unit Cost","Cost"]
[null,"BREACH WATER PONDS & CONTAINMENT BERMS"]
[null,"Remove/Level Berms (excavation)","MN-022, RB-013, RB-002, RB-003, RP-003, WM-001,DM-013, DM-014, DM-020","m3",{"$f":"45+154+77.8+90+90+76+453.6+28.8+76","v":1091.1999999999998},"TMAC",2.75,{"$f":"G5*E5","v":3000.7999999999993}]
[null,"Remove/Level Berms (grading)","DM-015, DM-035, MN-003, MS-003 & MS-012","m3",{"$f":"3130+1008+1008+1008+1008","v":7162},"TMAC",1.23,{"$f":"G6*E6","v":8809.26}]
[null,"Contour water intake area",null,"m3",null,{"$f":"NA()","v":{"$error":"#N/A"}},{"$f":"IF(ISNA(F7),0,INDEX(IF(UPPER(RIGHT(F7,1))=Low,UnitCostLow, IF(UPPER(RIGHT(F7,1))=High,UnitCostHigh,UnitCostSpecified)),MATCH(UPPER(LEFT(F7,LEN(F7)-1)),CostCode,0)))","v":0},{"$f":"G7*E7","v":0}]
[null,"STABILIZE SEDIMENT PONDS/WATER MANAGEMENT PONDS/SEWAGE DISCHARGE AREA"]
[null,"Place soil cover","Q2-003","m3",552,"TMAC",16.350000000000001,{"$f":"G9*E9","v":9025.2000000000007}]
[null,"Place erosion control blanket","Q2-002, Q2-003, PLA-001, WC-002","m2",{"$f":"2635+380+460+500+100","v":4075},"TMAC",4.84,19723]
{"$rows_left_out":53}
{"sheet":"Water Treatment","index":8,"n_rows":39,"n_cols":8,"rows_kept":39,"cut":false,"hidden":false,"merged":[]}
[1,"Post Closure Water Treatment - Identified as long term/post-closure in 'Instructions' worksheet"]
[]
[null,"ACTIVITY/MATERIAL","Notes","Units","Quantity","Cost Code","Unit Cost","Cost"]
[null,"ADDITION OF REAGENTS TO WTP"]
[null,"H2O2",null,"kg",null,{"$f":"NA()","v":{"$error":"#N/A"}},{"$f":"IF(ISNA(F5),0,INDEX(IF(UPPER(RIGHT(F5,1))=Low,UnitCostLow, IF(UPPER(RIGHT(F5,1))=High,UnitCostHigh,UnitCostSpecified)),MATCH(UPPER(LEFT(F5,LEN(F5)-1)),CostCode,0)))","v":0},{"$f":"G5*E5","v":0}]
[null,"lime",null,"kg",null,{"$f":"NA()","v":{"$error":"#N/A"}},0,0]
[null,"ferric sulphate",null,"kg",null,{"$f":"NA()","v":{"$error":"#N/A"}},0,0]
[null,"ferrous sulphate",null,"kg",null,{"$f":"NA()","v":{"$error":"#N/A"}},0,0]
[null,"flocculents",null,"kg",null,{"$f":"NA()","v":{"$error":"#N/A"}},0,0]
[null,"Other",null,null,null,{"$f":"NA()","v":{"$error":"#N/A"}},0,0]
{"$rows_left_out":30}
{"sheet":"ICM","index":9,"n_rows":23,"n_cols":8,"rows_kept":23,"cut":false,"hidden":false,"merged":[]}
[1,"Interim Care and Maintenance"]
[]
[null,"ACTIVITY/MATERIAL","Notes","Units","Quantity","Cost Code","Unit Cost","Cost"]
[null,"INTERIM CARE & MAINTENANCE"]
[null,"on-site caretaker","supervisor","hrs",null,"superh",{"$f":"IF(ISNA(F5),0,INDEX(IF(UPPER(RIGHT(F5,1))=Low,UnitCostLow, IF(UPPER(RIGHT(F5,1))=High,UnitCostHigh,UnitCostSpecified)),MATCH(UPPER(LEFT(F5,LEN(F5)-1)),CostCode,0)))","v":91.84},{"$f":"G5*E5","v":0}]
[null,"extra personnel","one skilled labourer","manmonths",null,"lab-sl",41,0]
[null,"    -electrician","incrmental cost to the overall ICM for Hope Bay","manmonths",null,"elech",{"$f":"IF(ISNA(F7),0,INDEX(IF(UPPER(RIGHT(F7,1))=Low,UnitCostLow, IF(UPPER(RIGHT(F7,1))=High,UnitCostHigh,UnitCostSpecified)),MATCH(UPPER(LEFT(F7,LEN(F7)-1)),CostCode,0)))","v":95},{"$f":"G7*E7","v":0}]
[null,"    -mechanic","incrmental cost to the overall ICM for Hope Bay","manmonths",null,"mechh",{"$f":"IF(ISNA(F8),0,INDEX(IF(UPPER(RIGHT(F8,1))=Low,UnitCostLow, IF(UPPER(RIGHT(F8,1))=High,UnitCostHigh,UnitCostSpecified)),MATCH(UPPER(LEFT(F8,LEN(F8)-1)),CostCode,0)))","v":72.849999999999994},{"$f":"G8*E8","v":0}]
[null,"annual fuel",null,"litre",null,"fcdh",1.39,0]
[null,"misc. supplies",null,"allow",null,"accmh",{"$f":"IF(ISNA(F10),0,INDEX(IF(UPPER(RIGHT(F10,1))=Low,UnitCostLow, IF(UPPER(RIGHT(F10,1))=High,UnitCostHigh,UnitCostSpecified)),MATCH(UPPER(LEFT(F10,LEN(F10)-1)),CostCode,0)))","v":175},{"$f":"G10*E10","v":0}]
{"$rows_left_out":14}
{"sheet":"Mobilization","index":10,"n_rows":57,"n_cols":10,"rows_kept":57,"cut":false,"hidden":false,"merged":[[50,2,51,2]]}
[1,"Mobilization/Demobilization:"]
[]
[null,"ACTIVITY/MATERIAL","Notes","Units","Quantity","Cost Code","Unit Cost","Cost"]
[null,"MOBILIZE HEAVY EQUIPMENT"]
[null,"Excavators","assume two excavators","km",null,"mherh",{"$f":"IF(ISNA(F5),0,INDEX(IF(UPPER(RIGHT(F5,1))=Low,UnitCostLow, IF(UPPER(RIGHT(F5,1))=High,UnitCostHigh,UnitCostSpecified)),MATCH(UPPER(LEFT(F5,LEN(F5)-1)),CostCode,0)))","v":10.25},{"$f":"G5*E5","v":0}]
[null,"Dump trucks","assume four dump trucks","km",null,"mherl",3.4,0]
[null,"Dozers","assume two dozers","km",null,"mherh",10.25,0]
[null,"Demolition shears","assume one set of shears","km",null,"mherh",10.25,0]
[null,"Crane","assume one crane ","km",null,"mherh",10.25,0]
[null,"Loader","assume one loader","km",null,"mherh",10.25,{"$f":"G10*E10","v":0}]
{"$rows_left_out":48}
{"sheet":"PostClosure","index":11,"n_rows":41,"n_cols":9,"rows_kept":41,"cut":false,"hidden":false,"merged":[]}
[1,"Post-Closure Monitoring &  Maintenance:"]
[]
[null,"ACTIVITY/MATERIAL","Notes","Units","Quantity","Cost Code","Unit Cost","Cost"]
[null,"MONITORING & INSPECTIONS"]
[null,"Annual geotechnical inspection","Year 1, 2, 3, 6, 10, 15, 20, & 25","each",1,"TMAC",28000,{"$f":"G5*E5","v":28000},"8 inspections @$35,000 each = $280,000"]
[null,"Cover Monitoirng Inspections","Year 2, 4, 6, 8, 10, 15, 20 &25","each",1,"TMAC",28000,28000,"8 inspections @$35,000 each = $280,000"]
[null,"Surface water sampling","Year 1 - 5, 7, 10, 15, 20 & 25","each",1,"TMAC",60000,60000,"10 insepctions @$60,000 = $600,000"]
[null,"Groundwater sampling",null,"each",null,"wsh",{"$f":"IF(ISNA(F8),0,INDEX(IF(UPPER(RIGHT(F8,1))=Low,UnitCostLow, IF(UPPER(RIGHT(F8,1))=High,UnitCostHigh,UnitCostSpecified)),MATCH(UPPER(LEFT(F8,LEN(F8)-1)),CostCode,0)))","v":10000},0]
[null,"Receiving.downstream water sampling",null,"each",null,"wsh",10000,0]
[null,"Monitoring program","initial confirmatory program","each",1,"TMAC",10000,10000,"1 time event prorated for 10 years total = $100,000"]
{"$rows_left_out":32}
{"sheet":"Open Pit","index":12,"n_rows":64,"n_cols":11,"rows_kept":64,"cut":false,"hidden":false,"merged":[]}
[1,"Open Pit Name: ",null,null,null,null,"Pit #",1]
[]
[null,"ACTIVITY/MATERIAL","Notes","Units","Quantity","Cost Code","Unit Cost","Cost","% Land","Land Cost","Water Cost"]
[null,"CONTROL ACCESS"]
[null,"Fence",null,"m",null,{"$f":"NA()","v":{"$error":"#N/A"}},{"$f":"IF(ISNA(F5),0,INDEX(IF(UPPER(RIGHT(F5,1))=Low,UnitCostLow, IF(UPPER(RIGHT(F5,1))=High,UnitCostHigh,UnitCostSpecified)),MATCH(UPPER(LEFT(F5,LEN(F5)-1)),CostCode,0)))","v":0},{"$f":"G5*E5","v":0},null,{"$f":"H5*I5","v":0},{"$f":"H5*(1-I5)","v":0}]
[null,"Signs",null,"each",null,"SH",37.08,{"$f":"G6*E6","v":0},null,{"$f":"H6*I6","v":0},{"$f":"H6*(1-I6)","v":0}]
[null,"Berm at crest",null,"m3",null,{"$f":"NA()","v":{"$error":"#N/A"}},{"$f":"IF(ISNA(F7),0,INDEX(IF(UPPER(RIGHT(F7,1))=Low,UnitCostLow, IF(UPPER(RIGHT(F7,1))=High,UnitCostHigh,UnitCostSpecified)),MATCH(UPPER(LEFT(F7,LEN(F7)-1)),CostCode,0)))","v":0},{"$f":"G7*E7","v":0},null,0,0]
[null,"Block roads",null,"m3",null,"RB1H",{"$f":"IF(ISNA(F8),0,INDEX(IF(UPPER(RIGHT(F8,1))=Low,UnitCostLow, IF(UPPER(RIGHT(F8,1))=High,UnitCostHigh,UnitCostSpecified)),MATCH(UPPER(LEFT(F8,LEN(F8)-1)),CostCode,0)))","v":17.05},{"$f":"G8*E8","v":0},null,0,0]
[null,"Other",null,null,null,{"$f":"NA()","v":{"$error":"#N/A"}},{"$f":"IF(ISNA(F9),0,INDEX(IF(UPPER(RIGHT(F9,1))=Low,UnitCostLow, IF(UPPER(RIGHT(F9,1))=High,UnitCostHigh,UnitCostSpecified)),MATCH(UPPER(LEFT(F9,LEN(F9)-1)),CostCode,0)))","v":0},{"$f":"G9*E9","v":0},null,{"$f":"H9*I9","v":0},{"$f":"H9*(1-I9)","v":0}]
[null,"STABILITY STUDY"]
{"$rows_left_out":55}
{"sheet":"Unit_Costs","index":13,"n_rows":172,"n_cols":12,"rows_kept":172,"cut":false,"hidden":false,"merged":[]}
["Unit Cost Table (for refining unit costs see \"Estimator\" worksheet)"]
[null,null,null,"Filter by unit",null,"",""]
[null,null,null,null,null,"","",""]
["ITEM","Detail",null,"COST CODE","UNITS","LOW $","HIGH $","SPECIFIED $",null,"COMMENTS"]
[null,null,null,null,null,"","",""]
["Accomodation"]
[null,null,null,"ACCM","manday",100,175]
["Buildings - Decontaminate",null,null,null,null,"","",""]
[null,"Asbestos",null,"BDA","m2",25.6,51.2,null,null,"Low: removal of asbestos siding & flooring; High: removal of insulated pipes, friable asbestos"]
["Buildings - Remove",null,null,null,null,"","","",null,"Unit costs are based on 3m high, single storey building.  Scale areas accordingly."]
{"$rows_left_out":163}
{"sheet":"Estimator","index":14,"n_rows":55,"n_cols":15,"rows_kept":55,"cut":false,"hidden":false,"merged":[]}
[null,"Unit Cost Estimator",null,1,"Equipment Productivity Figures and Graphs have been reproduced from Caterpillar Performance Handbook - Edition 42 "]
[null,"EXCAVATION",null,null,null,null,"HAUL AND DUMPING",null,null,null,null,"SPREADING/DOZING"]
[null,"Productivity",null,null,null,null,"Productivity",null,null,null,null,"Productivity"]
[null,"Machine","Cat 336EL",null,null,null,"Machine","Cat 770",null,null,null,"Machine","Cat D8"]
[null,"bucket capacity",null,3.16,"m3",null,"truck capacity",null,25.1,"m3",null,"Estimate production using example curves provided or ",null,600,"m3/hr"]
[null,"fill factor",null,0.75,"%",null,"fill factor",null,0.8,"%",null,"equivalent from other supplier"]
[null,"cycle time",null,45,"seconds",null,null,null,null,null,null,"Correction factors (see table provided)"]
[null,"operator skill",null,0.8,"%",null,"load time",null,6,"min.",null,"      operator skill",null,0.75]
[null,"machine availability",null,0.83,"%",null,"haul distance",null,1.5,"km",null,"      material type, see table",null,0.8]
[null,"altitude adjustment",null,1,"%",null,"average velocity",null,20,"km/hr",null,"      slot dozing",null,1]
{"$rows_left_out":46}
{"sheet":"Tools","index":15,"n_rows":12,"n_cols":12,"rows_kept":12,"cut":false,"hidden":false,"merged":[]}
["The functions in this worksheet serve as a back up in the event that the menu item \"Add-Ins\" is not shown in Excel menu bar"]
[]
[]
[null,null,"Save file before clearing all data"]
[]
[null,null,null,null,null,null,null,null,null,null,null,"These functions duplicate components within worksheet"]
[]
[]
[null,null,"Shows both active worksheet as well as table of Unit Costs in a separate window"]
[]
{"$rows_left_out":2}