{"text_format":"1","workbook":"xlsx","n_sheets":18,"sheets":["Instructions","Summary","Open Pit","UG Mine","Tailings","Rock Pile","Bldgs & Equip","Chemicals","Water Management","Water Treatment","ICM","PostClosure","LongTerm Monitoring","Mobilization","SBB Comp. Est.","Unit_Costs","Estimator","Tools"],"not_rendered":{"charts":0,"images":3,"macros":1,"external_links":72,"defined_names":10079,"comments":0,"pivot_tables":0},"unopened":[],"bounds":{"document_bytes":16777216,"sheet_cells":100000,"rows_first":2000,"rows_last":500,"rows_between":2000,"halvings":0,"cell_chars":16384,"cell_head_chars":4096},"cells_cut":0,"cells_raw":0,"read":"whole","date_system":"1900"}

{"sheet":"Instructions","index":0,"n_rows":69,"n_cols":8,"rows_kept":69,"cut":false,"hidden":false,"merged":[[58,0,67,1],[32,0,32,1],[33,0,38,1],[39,0,46,1],[47,0,53,1],[54,0,57,1]]}
["Project Name:",null,"Reclaim Model - Overview of Program"]
[null,"Back River Project       ","All users are urged to read the Reclaim Model User Manual - Scroll down for overview description of program.",null,null,"","",""]
[null,null,"Important!  Reclaim 7.0 works better with no other excel files open."]
[null,null,"If other excel files are open ignore run time error and proceed"]
["Reclaim Menu",null,"The default Excel menu bar has an additional tab labelled \"Add-Ins\" that provides options specific to the Reclaim Model.",null,null,"","",""]
[null,"Clear","This option deletes all input data, deletes any duplicated elements and blanks out the project name.  It also allows for segregation into land costs vs water costs if required.",null,null,"","",""]
{"$rows_left_out":64}
{"sheet":"Summary","index":1,"n_rows":37,"n_cols":19,"rows_kept":37,"cut":false,"hidden":false,"merged":[[1,9,1,17]]}
[null,"SUMMARY OF COSTS",null,null,null,null,null,null,null,null,null,null,"STAGING"]
[null,null,null,null,null,null,null,null,null,"Approximate Timing as proposed in Type A Water Licence"]
[null,null,null,null,null,null,null,null,null,"Y-3","Y-2","Y-1","Y1","Y-1","Y1","Y2","Y4","Y4 & Y5"]
["CAPITAL COSTS","COMPONENT NAME",null,"COST",null,"LAND LIABILITY",null,"TOTAL LIABILITY",null,"Initial Infrastructure","Umwelt OP","TSF","Llama OP","Llama UG","Umwelt UG","Goose Main OP","Goose Main UG","Echo OP & UG","Rationale"]
["OPEN PIT",{"$f":"IF(ISBLANK('Open Pit'!$C$1),\"\",'Open Pit'!$C$1)","v":"Umwelt"},null,{"$f":"Pit1Total","v":50424.887590743681},null,{"$f":"Pit1LandTotal","v":0},null,{"$f":"Pit1WaterTotal","v":50424.887490743684},null,null,{"$f":"H5","v":50424.887490743684},null,null,null,null,null,null,null,"The Umwelt Open Pit closure costs tie directly to commencement of Umwelt development."]
[null,{"$f":"IF(ISBLANK('Open Pit'!$N$1),\"\",'Open Pit'!$N$1)","v":"Llama "},null,{"$f":"'Open Pit'!$S$63","v":26176.6001},null,{"$f":"'Open Pit'!$U$63","v":0},null,{"$f":"'Open Pit'!$V$63","v":26176.6},null,null,null,null,{"$f":"H6","v":26176.6},null,null,null,null,null,"The Llama Open Pit closure costs tie directly to commencement of Llama development."]
{"$rows_left_out":32}
{"sheet":"Open Pit","index":2,"n_rows":64,"n_cols":58,"rows_kept":64,"cut":false,"hidden":false,"merged":[[22,46,23,46]]}
[5,"Open Pit Name: ","Umwelt",null,null,null,"Pit #",1,null,null,{"$f":"H1","v":1},null,"Open Pit Name: ","Llama ",null,null,null,"Pit #",{"$f":"H1+1","v":2},null,null,{"$f":"S1","v":2},null,"Open Pit Name: ","Echo",null,null,null,"Pit #",{"$f":"S1+1","v":3},null,null,{"$f":"AD1","v":3},null,"Open Pit Name: ","Goose Main",null,null,null,"Pit #",{"$f":"AD1+1","v":4},null,null,{"$f":"AO1","v":4},null,"Quarry Name: ","Airstrip Quarry",null,null,null,"Quarry #",1,null,null,{"$f":"AZ1","v":1},null,"ICRP Section ","Comments"]
[]
[null,"ACTIVITY/MATERIAL","Notes","Units","Quantity","Cost Code","Unit Cost","Cost","% Land","Land Cost","Total Cost",null,"ACTIVITY/MATERIAL","Notes","Units","Quantity","Cost Code","Unit Cost","Cost","% Land","Land Cost","Total Cost",null,"ACTIVITY/MATERIAL","Notes","Units","Quantity","Cost Code","Unit Cost","Cost","% Land","Land Cost","Total Cost",null,"ACTIVITY/MATERIAL","Notes","Units","Quantity","Cost Code","Unit Cost","Cost","% Land","Land Cost","Total Cost",null,"ACTIVITY/MATERIAL","Notes","Units","Quantity","Cost Code","Unit Cost","Cost","% Land","Land Cost","Total Cost"]
[null,"CONTROL ACCESS",null,null,null,null,null,null,null,null,null,null,"CONTROL ACCESS",null,null,null,null,null,null,null,null,null,null,"CONTROL ACCESS",null,null,null,null,null,null,null,null,null,null,"CONTROL ACCESS",null,null,null,null,null,null,null,null,null,null,"CONTROL ACCESS"]
[null,"Fence",null,"m",null,{"$f":"NA()","v":{"$error":"#N/A"}},{"$f":"IF(ISNA(F5),0,INDEX(IF(UPPER(RIGHT(F5,1))=Low,UnitCostLow, IF(UPPER(RIGHT(F5,1))=High,UnitCostHigh,UnitCostSpecified)),MATCH(UPPER(LEFT(F5,LEN(F5)-1)),CostCode,0)))","v":0},{"$f":"G5*E5","v":0},null,{"$f":"H5*I5","v":0},{"$f":"H5*(1-I5)","v":0},null,"Fence",null,"m",null,{"$f":"NA()","v":{"$error":"#N/A"}},{"$f":"IF(ISNA(Q5),0,INDEX(IF(UPPER(RIGHT(Q5,1))=Low,UnitCostLow, IF(UPPER(RIGHT(Q5,1))=High,UnitCostHigh,UnitCostSpecified)),MATCH(UPPER(LEFT(Q5,LEN(Q5)-1)),CostCode,0)))","v":0},{"$f":"R5*P5","v":0},null,{"$f":"S5*T5","v":0},{"$f":"S5*(1-T5)","v":0},null,"Fence",null,"m",null,{"$f":"NA()","v":{"$error":"#N/A"}},{"$f":"IF(ISNA(AB5),0,INDEX(IF(UPPER(RIGHT(AB5,1))=Low,UnitCostLow, IF(UPPER(RIGHT(AB5,1))=High,UnitCostHigh,UnitCostSpecified)),MATCH(UPPER(LEFT(AB5,LEN(AB5)-1)),CostCode,0)))","v":0},{"$f":"AC5*AA5","v":0},null,{"$f":"AD5*AE5","v":0},{"$f":"AD5*(1-AE5)","v":0},null,"Fence",null,"m",null,{"$f":"NA()","v":{"$error":"#N/A"}},{"$f":"IF(ISNA(AM5),0,INDEX(IF(UPPER(RIGHT(AM5,1))=Low,UnitCostLow, IF(UPPER(RIGHT(AM5,1))=High,UnitCostHigh,UnitCostSpecified)),MATCH(UPPER(LEFT(AM5,LEN(AM5)-1)),CostCode,0)))","v":0},{"$f":"AN5*AL5","v":0},null,{"$f":"AO5*AP5","v":0},{"$f":"AO5*(1-AP5)","v":0},null,"Fence",null,"m",null,{"$f":"NA()","v":{"$error":"#N/A"}},{"$f":"IF(ISNA(AX5),0,INDEX(IF(UPPER(RIGHT(AX5,1))=Low,UnitCostLow, IF(UPPER(RIGHT(AX5,1))=High,UnitCostHigh,UnitCostSpecified)),MATCH(UPPER(LEFT(AX5,LEN(AX5)-1)),CostCode,0)))","v":0},{"$f":"AY5*AW5","v":0},null,{"$f":"AZ5*BA5","v":0},{"$f":"AZ5*(1-BA5)","v":0}]
[null,"Signs","Assumed","each",4,"Sabina",75,{"$f":"G6*E6","v":300},null,{"$f":"H6*I6","v":0},{"$f":"H6*(1-I6)","v":300},null,"Signs","Assumed","each",4,"Sabina",75,{"$f":"R6*P6","v":300},null,0,300,null,"Signs","Assumed","each",4,"Sabina",75,{"$f":"AC6*AA6","v":300},null,0,300,null,"Signs","Assumed","each",4,"Sabina",75,{"$f":"AN6*AL6","v":300},null,0,300,null,"Signs",null,"each",null,{"$f":"NA()","v":{"$error":"#N/A"}},{"$f":"IF(ISNA(AX6),0,INDEX(IF(UPPER(RIGHT(AX6,1))=Low,UnitCostLow, IF(UPPER(RIGHT(AX6,1))=High,UnitCostHigh,UnitCostSpecified)),MATCH(UPPER(LEFT(AX6,LEN(AX6)-1)),CostCode,0)))","v":0},{"$f":"AY6*AW6","v":0},null,{"$f":"AZ6*BA6","v":0},{"$f":"AZ6*(1-BA6)","v":0}]
{"$rows_left_out":59}
{"sheet":"UG Mine","index":3,"n_rows":43,"n_cols":44,"rows_kept":43,"cut":false,"hidden":false,"merged":[]}
[4,"Underground Mine Name","Umwelt",null,null,null,"UG Mine #",1,null,null,{"$f":"H1","v":1},null,"Underground Mine Name","Llama",null,null,null,"UG Mine #",{"$f":"H1+1","v":2},null,null,{"$f":"S1","v":2},null,"Underground Mine Name","Goose Main",null,null,null,"UG Mine #",{"$f":"S1+1","v":3},null,null,{"$f":"AD1","v":3},null,"Underground Mine Name","Echo",null,null,null,"UG Mine #",{"$f":"AD1+1","v":4},null,null,{"$f":"AO1","v":4}]
[]
[null,"ACTIVITY/MATERIAL","Notes","Unit","Qty","Cost Code","Unit Cost","Cost","% Land","Land Cost","Total Cost",null,"ACTIVITY/MATERIAL","Notes","Unit","Qty","Cost Code","Unit Cost","Cost","% Land","Land Cost","Total Cost",null,"ACTIVITY/MATERIAL","Notes","Unit","Qty","Cost Code","Unit Cost","Cost","% Land","Land Cost","Total Cost",null,"ACTIVITY/MATERIAL","Notes","Unit","Qty","Cost Code","Unit Cost","Cost","% Land","Land Cost","Total Cost"]
[null,"CONTROL ACCESS",null,null,null,null,null,null,null,null,null,null,"CONTROL ACCESS",null,null,null,null,null,null,null,null,null,null,"CONTROL ACCESS",null,null,null,null,null,null,null,null,null,null,"CONTROL ACCESS"]
[null,"Fence",null,"m",null,{"$f":"NA()","v":{"$error":"#N/A"}},{"$f":"IF(ISNA(F5),0,INDEX(IF(UPPER(RIGHT(F5,1))=Low,UnitCostLow, IF(UPPER(RIGHT(F5,1))=High,UnitCostHigh,UnitCostSpecified)),MATCH(UPPER(LEFT(F5,LEN(F5)-1)),CostCode,0)))","v":0},{"$f":"G5*E5","v":0},null,{"$f":"H5*I5","v":0},{"$f":"H5*(1-I5)","v":0},null,"Fence",null,"m",null,{"$f":"NA()","v":{"$error":"#N/A"}},{"$f":"IF(ISNA(Q5),0,INDEX(IF(UPPER(RIGHT(Q5,1))=Low,UnitCostLow, IF(UPPER(RIGHT(Q5,1))=High,UnitCostHigh,UnitCostSpecified)),MATCH(UPPER(LEFT(Q5,LEN(Q5)-1)),CostCode,0)))","v":0},{"$f":"R5*P5","v":0},null,{"$f":"S5*T5","v":0},{"$f":"S5*(1-T5)","v":0},null,"Fence",null,"m",null,{"$f":"NA()","v":{"$error":"#N/A"}},{"$f":"IF(ISNA(AB5),0,INDEX(IF(UPPER(RIGHT(AB5,1))=Low,UnitCostLow, IF(UPPER(RIGHT(AB5,1))=High,UnitCostHigh,UnitCostSpecified)),MATCH(UPPER(LEFT(AB5,LEN(AB5)-1)),CostCode,0)))","v":0},{"$f":"AC5*AA5","v":0},null,{"$f":"AD5*AE5","v":0},{"$f":"AD5*(1-AE5)","v":0},null,"Fence",null,"m",null,{"$f":"NA()","v":{"$error":"#N/A"}},{"$f":"IF(ISNA(AM5),0,INDEX(IF(UPPER(RIGHT(AM5,1))=Low,UnitCostLow, IF(UPPER(RIGHT(AM5,1))=High,UnitCostHigh,UnitCostSpecified)),MATCH(UPPER(LEFT(AM5,LEN(AM5)-1)),CostCode,0)))","v":0},{"$f":"AN5*AL5","v":0},null,{"$f":"AO5*AP5","v":0},{"$f":"AO5*(1-AP5)","v":0}]
[null,"Signs",null,"each",null,{"$f":"NA()","v":{"$error":"#N/A"}},0,0,null,{"$f":"H6*I6","v":0},0,null,"Signs",null,"each",null,{"$f":"NA()","v":{"$error":"#N/A"}},0,0,null,{"$f":"S6*T6","v":0},{"$f":"S6*(1-T6)","v":0},null,"Signs",null,"each",null,{"$f":"NA()","v":{"$error":"#N/A"}},0,0,null,{"$f":"AD6*AE6","v":0},{"$f":"AD6*(1-AE6)","v":0},null,"Signs",null,"each",null,{"$f":"NA()","v":{"$error":"#N/A"}},0,0,null,{"$f":"AO6*AP6","v":0},{"$f":"AO6*(1-AP6)","v":0}]
{"$rows_left_out":38}
{"sheet":"Tailings","index":4,"n_rows":82,"n_cols":11,"rows_kept":82,"cut":false,"hidden":false,"merged":[]}
[1,"Tailings Impoundment Name:","TSF",null,null,null,"Pond #",1]
[]
[null,"ACTIVITY/MATERIAL","Notes","Units","Quantity","Cost Code","Unit Cost","Cost","% Land","Land Cost","Total Cost"]
[null,"CONTROL ACCESS"]
[null,"Fence",null,"m",null,{"$f":"NA()","v":{"$error":"#N/A"}},{"$f":"IF(ISNA(F5),0,INDEX(IF(UPPER(RIGHT(F5,1))=Low,UnitCostLow, IF(UPPER(RIGHT(F5,1))=High,UnitCostHigh,UnitCostSpecified)),MATCH(UPPER(LEFT(F5,LEN(F5)-1)),CostCode,0)))","v":0},{"$f":"G5*E5","v":0},null,{"$f":"H5*I5","v":0},{"$f":"+H5*(1-I5)","v":0}]
[null,"Signs",null,"each",null,{"$f":"NA()","v":{"$error":"#N/A"}},0,0,null,{"$f":"H6*I6","v":0},{"$f":"+H6*(1-I6)","v":0}]
{"$rows_left_out":77}
{"sheet":"Rock Pile","index":5,"n_rows":66,"n_cols":11,"rows_kept":66,"cut":false,"hidden":false,"merged":[]}
[1,"Rock Pile Name:","Umwelt, Llama, Echo and TSF"]
[]
[null,"ACTIVITY/MATERIAL","Notes","Units","Quantity","Cost Code","Unit Cost","Cost","% Land","Land Cost","Total Cost"]
[null,"STABILIZE SLOPES"]
[null,"Flatten slopes with dozer",null,"m3",null,{"$f":"NA()","v":{"$error":"#N/A"}},{"$f":"IF(ISNA(F5),0,INDEX(IF(UPPER(RIGHT(F5,1))=Low,UnitCostLow, IF(UPPER(RIGHT(F5,1))=High,UnitCostHigh,UnitCostSpecified)),MATCH(UPPER(LEFT(F5,LEN(F5)-1)),CostCode,0)))","v":0},{"$f":"G5*E5","v":0},null,{"$f":"H5*I5","v":0},{"$f":"+H5*(1-I5)","v":0}]
[null,"Flatten \"bubble dump\" areas",null,"m3",null,{"$f":"NA()","v":{"$error":"#N/A"}},0,0,null,0,0]
{"$rows_left_out":61}
{"sheet":"Bldgs & Equip","index":6,"n_rows":68,"n_cols":11,"rows_kept":68,"cut":false,"hidden":false,"merged":[]}
[1,"Building / Equip Name:",null,null,null,null,"Bldg / Equip #:",1]
[]
[null,"ACTIVITY/MATERIAL","Notes","Units","Quantity","Cost Code","Unit Cost","Cost","% Land","Land Cost","Total Cost"]
[null,"DISPOSE MOBILE EQUIPMENT"]
[null,"Decontaminate and ship off-site",null,"allow",null,{"$f":"NA()","v":{"$error":"#N/A"}},{"$f":"IF(ISNA(F5),0,INDEX(IF(UPPER(RIGHT(F5,1))=Low,UnitCostLow, IF(UPPER(RIGHT(F5,1))=High,UnitCostHigh,UnitCostSpecified)),MATCH(UPPER(LEFT(F5,LEN(F5)-1)),CostCode,0)))","v":0},{"$f":"G5*E5","v":0},null,{"$f":"H5*I5","v":0},{"$f":"+H5*(1-I5)","v":0}]
[null,"Decontaminate and dispose on-site","Drive or transport to landfill; drain fluids; NPAG cover cost below","allow",1,"Sabina",20000,{"$f":"G6*E6","v":20000},null,{"$f":"H6*I6","v":0},{"$f":"+H6*(1-I6)","v":20000}]
{"$rows_left_out":63}
{"sheet":"Chemicals","index":7,"n_rows":55,"n_cols":14,"rows_kept":55,"cut":false,"hidden":false,"merged":[[2,1,2,7]]}
[1,"Chemicals/Soil Area Name:"]
[]
[null,"Note:         The procedures, equipment and packaging for clean up and removal of chemicals or contaminated soils are highly dependent on the nature of the chemicals and their existing state of containment. Government guidelines should be consulted on an individual chemical basis.  Any estimate made here should be considered very rough unless specific evaluations have been conducted."]
[null,"ACTIVITY/MATERIAL","Notes","Units","Quantity","Cost Code","Unit Cost","Cost","% Land","Land Cost","Total Cost",null,"ICRP Section ","Comments"]
[null,"HAZARDOUS MATERIALS AUDIT"]
[null,"Hazardous materials audit",null,"mandays",null,{"$f":"NA()","v":{"$error":"#N/A"}},{"$f":"IF(ISNA(F6),0,INDEX(IF(UPPER(RIGHT(F6,1))=Low,UnitCostLow, IF(UPPER(RIGHT(F6,1))=High,UnitCostHigh,UnitCostSpecified)),MATCH(UPPER(LEFT(F6,LEN(F6)-1)),CostCode,0)))","v":0},{"$f":"G6*E6","v":0},null,{"$f":"H6*I6","v":0},{"$f":"+H6*(1-I6)","v":0}]
{"$rows_left_out":50}
{"sheet":"Water Management","index":8,"n_rows":78,"n_cols":20,"rows_kept":78,"cut":false,"hidden":false,"merged":[[1,10,1,18]]}
[1,"Capital Expenditures and Short Term Water Treatment identified in 'Instructions' worksheet"]
[null,null,null,null,null,null,null,null,null,null,"Staging"]
[null,"ACTIVITY/MATERIAL","Notes","Units","Quantity","Cost Code","Unit Cost","Total Cost",null,null,"Y-3","Y-2","Y-1","Y1","Y-1","Y1","Y2","Y4","Y4 & Y5","ICRP Section "]
[null,"BREACH DYKE EMBANKMENT",null,null,null,null,null,null,null,null,"Initial Infrastructre","Umwelt OP","TSF","Llama OP","Llama UG","Umwelt UG","Goose Main OP","Goose Main UG","Echo OP & UG"]
[null,"Breach Llama Lake Diversion Berms",null,"m3",{"$f":"'SBB Comp. Est.'!F62","v":665},{"$f":"NA()","v":{"$error":"#N/A"}},{"$f":"'SBB Comp. Est.'!W62","v":7.3},{"$f":"G5*E5","v":4854.5},null,null,null,null,null,{"$f":"H5","v":4854.5}]
[null,"Breach Llama WRSA Diversion Berm",null,"m3",{"$f":"'SBB Comp. Est.'!F63","v":95},{"$f":"NA()","v":{"$error":"#N/A"}},{"$f":"'SBB Comp. Est.'!W63","v":7.3},{"$f":"G6*E6","v":693.5},null,null,null,null,null,{"$f":"H6","v":693.5}]
{"$rows_left_out":73}
{"sheet":"Water Treatment","index":9,"n_rows":37,"n_cols":10,"rows_kept":37,"cut":false,"hidden":false,"merged":[]}
[1,"Post Closure Water Treatment - Identified as long term/post-closure in 'Instructions' worksheet"]
[]
[null,"ACTIVITY/MATERIAL","Notes","Units","Quantity","Cost Code","Unit Cost","Total Cost",null,"ICRP Section "]
[null,"ADDITION OF REAGENTS TO WTP"]
[null,"H2O2",null,"kg",null,{"$f":"NA()","v":{"$error":"#N/A"}},{"$f":"IF(ISNA(F5),0,INDEX(IF(UPPER(RIGHT(F5,1))=Low,UnitCostLow, IF(UPPER(RIGHT(F5,1))=High,UnitCostHigh,UnitCostSpecified)),MATCH(UPPER(LEFT(F5,LEN(F5)-1)),CostCode,0)))","v":0},{"$f":"G5*E5","v":0}]
[null,"lime",null,"kg",null,{"$f":"NA()","v":{"$error":"#N/A"}},0,0]
{"$rows_left_out":32}
{"sheet":"ICM","index":10,"n_rows":22,"n_cols":10,"rows_kept":22,"cut":false,"hidden":false,"merged":[]}
[1,"Interim Care and Maintenance"]
[]
[null,"ACTIVITY/MATERIAL","Notes","Units","Quantity","Cost Code","Unit Cost","Total Cost",null,"ICRP Section "]
[null,"INTERIM CARE & MAINTENANCE"]
[null,"Camp operation","Caretaker and summer personnel","mandays",{"$f":"180+6*21","v":306},"Sabina",{"$f":"'SBB Comp. Est.'!U118","v":110},{"$f":"G5*E5","v":33660}]
[null,"On-site staff","Caretaker and summer personnel","manhours",{"$f":"(180+6*21)*10","v":3060},"ENVCO",{"$f":"Unit_Costs!F77","v":74.16},226929.59999999998]
{"$rows_left_out":17}
{"sheet":"PostClosure","index":11,"n_rows":40,"n_cols":40,"rows_kept":40,"cut":false,"hidden":false,"merged":[[0,6,0,7],[0,14,0,15],[0,22,0,23],[0,30,0,31],[0,38,0,39]]}
[1,null,null,null,null,null,"7 Years\n(Year 11 to 17)",null,null,null,null,null,null,null,"8 Years\n(Year 11 to 18)",null,null,null,null,null,null,null,"10 Years\n(Year 11 to 20)",null,null,null,null,null,null,null,"13 Years \n(Year 11 to 23)",null,null,null,null,null,null,null,"Beyond Post Closure (Long Term 1 to 5, 7, 10, 15, 25)"]
[]
[null,"ACTIVITY/MATERIAL - WATER TREATMENT","Notes","Units","Quantity","Cost Code","Unit Cost","Total Cost",null,"ACTIVITY/MATERIAL - GEOTECHNICAL INSPECTIONS OF TSF ","Notes","Units","Quantity","Cost Code","Unit Cost","Total Cost",null,"ACTIVITY/MATERIAL - WEMP and TERRESTRIAL","Notes","Units","Quantity","Cost Code","Unit Cost","Total Cost",null,"ACTIVITY/MATERIAL - Monitoring & Maintenance","Notes","Units","Quantity","Cost Code","Unit Cost","Total Cost",null,"ACTIVITY/MATERIAL - Long Term Monitoring ","Notes","Units","Quantity","Cost Code","Unit Cost","Total Cost"]
[null,"MONITORING & INSPECTIONS",null,null,null,null,null,null,null,"MONITORING & INSPECTIONS",null,null,null,null,null,null,null,"MONITORING & INSPECTIONS",null,null,null,null,null,null,null,"MONITORING & INSPECTIONS",null,null,null,null,null,null,null,"MONITORING & INSPECTIONS"]
[null,"Total geotechnical inspections (1 yearly)",null,"year",{"$f":"'SBB Comp. Est.'!N142/8","v":0},{"$f":"NA()","v":{"$error":"#N/A"}},{"$f":"IF(ISNA(F5),0,INDEX(IF(UPPER(RIGHT(F5,1))=Low,UnitCostLow, IF(UPPER(RIGHT(F5,1))=High,UnitCostHigh,UnitCostSpecified)),MATCH(UPPER(LEFT(F5,LEN(F5)-1)),CostCode,0)))","v":0},{"$f":"G5*E5","v":0},null,"Total geotechnical inspections (1 yearly)","Annual inspection of the TSF from Closure until embankment breaching in Year 18 (8 years).","year",{"$f":"'SBB Comp. Est.'!F142/8","v":1},"RPTH",{"$f":"IF(ISNA(N5),0,INDEX(IF(UPPER(RIGHT(N5,1))=Low,UnitCostLow, IF(UPPER(RIGHT(N5,1))=High,UnitCostHigh,UnitCostSpecified)),MATCH(UPPER(LEFT(N5,LEN(N5)-1)),CostCode,0)))","v":20000},{"$f":"O5*M5","v":20000},null,"Total geotechnical inspections (1 yearly)",null,"year",null,{"$f":"NA()","v":{"$error":"#N/A"}},{"$f":"IF(ISNA(V5),0,INDEX(IF(UPPER(RIGHT(V5,1))=Low,UnitCostLow, IF(UPPER(RIGHT(V5,1))=High,UnitCostHigh,UnitCostSpecified)),MATCH(UPPER(LEFT(V5,LEN(V5)-1)),CostCode,0)))","v":0},{"$f":"W5*U5","v":0},null,"Total geotechnical inspections (1 yearly)",null,"year",null,{"$f":"NA()","v":{"$error":"#N/A"}},{"$f":"IF(ISNA(AD5),0,INDEX(IF(UPPER(RIGHT(AD5,1))=Low,UnitCostLow, IF(UPPER(RIGHT(AD5,1))=High,UnitCostHigh,UnitCostSpecified)),MATCH(UPPER(LEFT(AD5,LEN(AD5)-1)),CostCode,0)))","v":0},{"$f":"AE5*AC5","v":0},null,"General Water Sampling and Stability Monitoring","long term general monitoring ","year",1,"Sabina",40000,{"$f":"AM5*AK5","v":40000}]
[null,"Waste Rock Piles",null,"year",null,{"$f":"NA()","v":{"$error":"#N/A"}},{"$f":"IF(ISNA(F6),0,INDEX(IF(UPPER(RIGHT(F6,1))=Low,UnitCostLow, IF(UPPER(RIGHT(F6,1))=High,UnitCostHigh,UnitCostSpecified)),MATCH(UPPER(LEFT(F6,LEN(F6)-1)),CostCode,0)))","v":0},{"$f":"G6*E6","v":0},null,"Waste Rock Piles",null,"year",null,{"$f":"NA()","v":{"$error":"#N/A"}},0,0,null,"Waste Rock Piles",null,"year",null,{"$f":"NA()","v":{"$error":"#N/A"}},{"$f":"IF(ISNA(V6),0,INDEX(IF(UPPER(RIGHT(V6,1))=Low,UnitCostLow, IF(UPPER(RIGHT(V6,1))=High,UnitCostHigh,UnitCostSpecified)),MATCH(UPPER(LEFT(V6,LEN(V6)-1)),CostCode,0)))","v":0},{"$f":"W6*U6","v":0},null,"Waste Rock Piles","Annual inspection of WR piles from closure to post-closure (13 years)","year",{"$f":"'SBB Comp. Est.'!F143/13","v":1},"Sabina",{"$f":"'SBB Comp. Est.'!$W143","v":8300},{"$f":"AE6*AC6","v":8300},null,"Waste Rock Piles",null,"year",null,{"$f":"NA()","v":{"$error":"#N/A"}},{"$f":"IF(ISNA(AL6),0,INDEX(IF(UPPER(RIGHT(AL6,1))=Low,UnitCostLow, IF(UPPER(RIGHT(AL6,1))=High,UnitCostHigh,UnitCostSpecified)),MATCH(UPPER(LEFT(AL6,LEN(AL6)-1)),CostCode,0)))","v":0},0]
{"$rows_left_out":35}
{"sheet":"LongTerm Monitoring","index":12,"n_rows":47,"n_cols":6,"rows_kept":47,"cut":false,"hidden":false,"merged":[[26,0,45,0],[46,1,46,3],[1,4,1,5],[3,0,12,0],[13,0,14,0],[15,0,20,0],[21,0,25,0],[0,1,0,2],[1,3,2,3],[1,2,2,2],[1,1,2,1],[1,0,2,0]]}
[null,"Annual Discout Rate:",null,0.03]
["Project Phase","Project Year ","Closure Year","Post-Closure Monitoring Year","Long Term Monitoring (GTCs, physical, water) "]
[null,null,null,null,"One Time Cost","Yearly Total NPV"]
["Operations",1,null,null,null,{"$f":"E4/(1+$D$1)^($C4-1)","v":0}]
[null,{"$f":"B4+1","v":2},null,null,null,0]
[null,{"$f":"B5+1","v":3},null,null,null,0]
{"$rows_left_out":42}
{"sheet":"Mobilization","index":13,"n_rows":61,"n_cols":11,"rows_kept":61,"cut":false,"hidden":false,"merged":[]}
[1,"Mobilization/Demobilization:"]
[]
[null,"ACTIVITY/MATERIAL","Notes","Units","Quantity","Cost Code","Unit Cost","Cost",null,"ICRP Section ","Comments"]
[null,"MOBILIZE HEAVY EQUIPMENT","Assumes mining equipment on abandoned mine site is operable and available."]
[null,"Light duty vehicles","Purchase pickups and Vans","each",null,{"$f":"NA()","v":{"$error":"#N/A"}},{"$f":"IF(ISNA(F5),0,INDEX(IF(UPPER(RIGHT(F5,1))=Low,UnitCostLow, IF(UPPER(RIGHT(F5,1))=High,UnitCostHigh,UnitCostSpecified)),MATCH(UPPER(LEFT(F5,LEN(F5)-1)),CostCode,0)))","v":0},{"$f":"G5*E5","v":0}]
[null,"Telehandlers","Purchase (standby)","each",null,{"$f":"NA()","v":{"$error":"#N/A"}},0,0]
{"$rows_left_out":56}
{"sheet":"SBB Comp. Est.","index":14,"n_rows":174,"n_cols":24,"rows_kept":174,"cut":false,"hidden":false,"merged":[]}
["Sabina Closure Component Estimating"]
[]
[null,null,null,null,null,null,null,"Labour",null,null,null,null,"Material",null,"Fixed Equipment",null,"Mobile Equip",null,"Const Equip Use",null,"Other",null,"Total"]
["Code","Description","NOTES","EQUIPMENT\nNUMBER","ESTIMATE SOURCE\nDOCUMENT","Qty","Unit of Measure","Unit Man-hrs","Prod Fact","Total Man-hrs","Unit Cost","Total Cost","Unit Cost","Total Cost","Unit Cost","Total Cost","Unit Cost","Total Cost","Unit Cost","Total Cost","Unit Cost","Total Cost","Unit Cost","Total Cost"]
[null,"Open Pit Closure"]
[null,"Place Boulder Fence"]
{"$rows_left_out":169}
{"sheet":"Unit_Costs","index":15,"n_rows":172,"n_cols":12,"rows_kept":172,"cut":false,"hidden":false,"merged":[]}
["Unit Cost Table (for refining unit costs see \"Estimator\" worksheet)"]
[null,null,null,"Filter by unit",null,"",""]
[null,null,null,null,null,"","",""]
["ITEM","Detail",null,"COST CODE","UNITS","LOW $","HIGH $","SPECIFIED $",null,"COMMENTS"]
[null,null,null,null,null,"","",""]
["Accomodation"]
{"$rows_left_out":167}
{"sheet":"Estimator","index":16,"n_rows":55,"n_cols":15,"rows_kept":55,"cut":false,"hidden":false,"merged":[]}
[null,"Unit Cost Estimator",null,1,"Equipment Productivity Figures and Graphs have been reproduced from Caterpillar Performance Handbook - Edition 42 "]
[null,"EXCAVATION",null,null,null,null,"HAUL AND DUMPING",null,null,null,null,"SPREADING/DOZING"]
[null,"Productivity",null,null,null,null,"Productivity",null,null,null,null,"Productivity"]
[null,"Machine","Cat 336EL",null,null,null,"Machine","Cat 770",null,null,null,"Machine","Cat D8"]
[null,"bucket capacity",null,3.16,"m3",null,"truck capacity",null,25.1,"m3",null,"Estimate production using example curves provided or ",null,600,"m3/hr"]
[null,"fill factor",null,0.75,"%",null,"fill factor",null,0.8,"%",null,"equivalent from other supplier"]
{"$rows_left_out":50}
{"sheet":"Tools","index":17,"n_rows":12,"n_cols":12,"rows_kept":12,"cut":false,"hidden":false,"merged":[]}
["The functions in this worksheet serve as a back up in the event that the menu item \"Add-Ins\" is not shown in Excel menu bar"]
[]
[]
[null,null,"Save file before clearing all data"]
[]
[null,null,null,null,null,null,null,null,null,null,null,"These functions duplicate components within worksheet"]
{"$rows_left_out":6}