{"text_format":"1","workbook":"xlsx","n_sheets":15,"sheets":["Instructions","Tools","Summary","Open Pit","UG Mine","Tailings","Rock Pile","Chemicals","Bldgs & Equip","Water Management","Water Treatment","ICM","PostClosure","Mobilization","Estimator"],"not_rendered":{"charts":0,"images":3,"macros":1,"external_links":1,"defined_names":161,"comments":1,"pivot_tables":0},"unopened":[],"bounds":{"document_bytes":16777216,"sheet_cells":100000,"rows_first":2000,"rows_last":500,"rows_between":2000,"halvings":0,"cell_chars":16384,"cell_head_chars":4096},"cells_cut":0,"cells_raw":0,"read":"whole","date_system":"1900"}

{"sheet":"Instructions","index":0,"n_rows":70,"n_cols":8,"rows_kept":70,"cut":false,"hidden":false,"merged":[[59,0,68,1],[33,0,33,1],[34,0,39,1],[40,0,47,1],[48,0,54,1],[55,0,58,1]]}
["Project Name:",null,"Reclaim Model - Overview of Program"]
[null,"Hope Bay Doris Madrid Sec","All users are urged to read the Reclaim Model User Manual - Scroll down for overview description of program.",null,null,"","",""]
[null,null,"Important!  Reclaim 7.0 works better with no other excel files open."]
[null,null,"If other excel files are open ignore run time error and proceed"]
["Reclaim Menu",null,"The default Excel menu bar has an additional tab labelled \"Add-Ins\" that provides options specific to the Reclaim Model.",null,null,"","",""]
[null,"Clear","This option deletes all input data, deletes any duplicated elements and blanks out the project name.  It also allows for segregation into land costs vs water costs if required.",null,null,"","",""]
[null,"Duplicate","This option Duplicates components of the project. E.g. if there is more than one Open Pit, use duplicate to add a second Open Pit.  Quantities for the new Open Pit are erased, but the Activities and Cost Codes are carried over from the original Open Pit.  The new Open Pit subtotal is added to the Summary page.",null,null,"","",""]
[null,"Unit Costs","This option opens a window of unit costs to provide easy reference.  NOTE:  the unit cost table has a filter in the 'UNITS' column.   You can select to only see a particular unit (eg km) or multiple units (km and m3) or all units.",null,null,"","",""]
[null,"Print All ","This option prints the Summary Worksheet, Unit Cost Worksheet, and the individual component worksheets having non-zero balances.  Individual worksheets can be printed directly using standard printing methods, such as Ctl - P.",null,null,"","",""]
[null,"Quit","Select Quit to exit the program",null,null,"","",""]
{"$rows_left_out":61}
{"sheet":"Tools","index":1,"n_rows":12,"n_cols":12,"rows_kept":12,"cut":false,"hidden":false,"merged":[]}
["The functions in this worksheet serve as a back up in the event that the menu item \"Add-Ins\" is not shown in Excel menu bar"]
[]
[]
[null,null,"Save file before clearing all data"]
[]
[null,null,null,null,null,null,null,null,null,null,null,"These functions duplicate components within worksheet"]
[]
[]
[null,null,"Shows both active worksheet as well as table of Unit Costs in a separate window"]
[]
{"$rows_left_out":3}
{"sheet":"Summary","index":2,"n_rows":26,"n_cols":8,"rows_kept":26,"cut":false,"hidden":false,"merged":[]}
[null,"SUMMARY OF COSTS"]
[]
["CAPITAL COSTS","COMPONENT NAME",null,"COST",null,"LAND LIABILITY",null,"WATER LIABILITY"]
["OPEN PIT",{"$f":"IF(ISBLANK('Open Pit'!$B$1),\"\",'Open Pit'!$B$1)","v":"Quarry ROQ Drill, Blast, and Crush Material"},null,{"$f":"Pit1Total","v":4190607.7747048209},null,{"$f":"Pit1LandTotal","v":4190607.7746048211},null,{"$f":"Pit1WaterTotal","v":0}]
["UNDERGROUND MINE",{"$f":"IF(ISBLANK('UG Mine'!$B$1),\"\",'UG Mine'!$B$1)","v":"Doris Portal and Underground Works"},null,{"$f":"UG1Total","v":3344311.3683879995},null,{"$f":"UG1LandTotal","v":3344311.3682879996},null,{"$f":"UG1WaterTotal","v":0}]
["TAILINGS FACILITY",{"$f":"IF(ISBLANK(Tailings!$B$1),\"\",Tailings!$B$1)","v":"TIA Subaerial Tailings Area, North Dam, Shoreline Protection, and Interim Dyke"},null,{"$f":"Tailings1Total","v":12561086.364760833},null,{"$f":"Tailings1LandTotal","v":6280543.1823304165},null,{"$f":"Tailings1WaterTotal","v":6280543.1823304165}]
["ROCK PILE",{"$f":"IF(ISBLANK('Rock Pile'!$B$1),\"\",'Rock Pile'!$B$1)","v":"Doris, Madrid, Roberts Bay Rock Piles"},null,{"$f":"RP1Total","v":1398358.775989},null,{"$f":"RP1LandTotal","v":1398358.7758889999},null,{"$f":"RP1WaterTotal","v":0}]
["BUILDINGS AND EQUIPMENT",{"$f":"IF(ISBLANK('Bldgs & Equip'!$B$1),\"\",'Bldgs & Equip'!$B$1)","v":"Site Buildings"},null,{"$f":"Bldg1Total","v":10727366.103955407},null,{"$f":"Bldg1LandTotal","v":8863055.7852731794},null,{"$f":"Bldg1WaterTotal","v":1864310.3185822279}]
["CHEMICALS AND CONTAMINATED SOIL MANAGEMENT",{"$f":"IF(ISBLANK(Chemicals!$B$1),\"\",Chemicals!$B$1)","v":"Decontaminate Oil, Fuel, and Containment Liners"},null,{"$f":"Chem1Total","v":1625660.5232510499},null,{"$f":"Chem1LandTotal","v":812830.26157552493},null,{"$f":"Chem1WaterTotal","v":812830.26157552493}]
["SURFACE AND GROUNDWATER MANAGEMENT",{"$f":"IF(ISBLANK('Water Treatment'!$B$1),\"\",'Water Treatment'!$B$1)","v":"Remove / Level Berms, Water Management , Water Treatment"},null,{"$f":"Water1Total","v":1126649.1869012311},null,"-",null,{"$f":"Water1Total","v":1126649.1869012311}]
{"$rows_left_out":17}
{"sheet":"Open Pit","index":3,"n_rows":83,"n_cols":11,"rows_kept":83,"cut":false,"hidden":false,"merged":[]}
["Open Pit Name: ","Quarry ROQ Drill, Blast, and Crush Material",null,null,null,"Pit #",1]
[]
["ACTIVITY/MATERIAL","Notes","Units","Quantity","Cost Code","Unit Cost","Cost","% Land","Land Cost","Water Cost","Comments"]
["NO REQUIREMENT"]
["DW_002 Doris-Windy All Weather Road Quarry A","No closure activities are required","each",null,{"$error":"#N/A"},0,{"$f":"D5*F5","v":0},null,{"$f":"G5*H5","v":0},{"$f":"G5*(1-H5)","v":0}]
["DW_003 Doris-Windy All Weather Road Quarry B","No closure activities are required","each",null,{"$error":"#N/A"},0,{"$f":"D6*F6","v":0},null,{"$f":"G6*H6","v":0},{"$f":"G6*(1-H6)","v":0}]
["DW_007 Doris-Windy All Weather Road Quarry D","No closure activities are required","each",null,{"$error":"#N/A"},0,0,null,0,0]
["Q2_001 Quarry 2 Quarry","No closure activities are required","each",null,{"$error":"#N/A"},0,0,null,0,0]
["Q3_001 Quarry 3 Quarry #3","No closure activities are required","each",null,{"$error":"#N/A"},0,0,null,0,0]
["QUARRY ROCK MATERIAL"]
{"$rows_left_out":74}
{"sheet":"UG Mine","index":4,"n_rows":52,"n_cols":11,"rows_kept":52,"cut":false,"hidden":false,"merged":[]}
["Underground Mine Name","Doris Portal and Underground Works",null,null,null,"UG Mine #",1]
[]
["ACTIVITY/MATERIAL","Notes","Unit","Quantity","Cost Code","Unit Cost","Cost","% Land","Land Cost","Water Cost","Comments"]
["CONTROL ACCESS"]
["Fence",null,"m",null,{"$error":"#N/A"},0,{"$f":"D5*F5","v":0},null,{"$f":"G5*H5","v":0},{"$f":"G5*(1-H5)","v":0}]
["Signs",null,"each",null,{"$error":"#N/A"},0,{"$f":"D6*F6","v":0},null,{"$f":"G6*H6","v":0},{"$f":"G6*(1-H6)","v":0}]
["Block roads",null,"m3",null,{"$error":"#N/A"},0,0,null,0,0]
["Berm",null,"m3",null,{"$error":"#N/A"},0,0,null,0,0]
["Concrete wall in  portals",null,"m3",null,{"$error":"#N/A"},0,0,null,{"$f":"G9*H9","v":0},{"$f":"G9*(1-H9)","v":0}]
["Backfill portal",null,"m3",null,{"$error":"#N/A"},0,0,null,0,0]
{"$rows_left_out":43}
{"sheet":"Tailings","index":5,"n_rows":100,"n_cols":11,"rows_kept":100,"cut":false,"hidden":false,"merged":[]}
["Tailings Impoundment Name:","TIA Subaerial Tailings Area, North Dam, Shoreline Protection, and Interim Dyke",null,null,null,"Pond #",1]
[]
["ACTIVITY/MATERIAL","Notes","Unit","Quantity","Cost Code","Unit Cost","Cost","% Land","Land Cost","Water Cost","Comments"]
["CONTROL ACCESS"]
["Fence",null,"m",null,{"$error":"#N/A"},0,{"$f":"D5*F5","v":0},0,{"$f":"G5*H5","v":0},{"$f":"+G5*(1-H5)","v":0}]
["Signs",null,"each",null,{"$error":"#N/A"},0,{"$f":"D6*F6","v":0},0,{"$f":"G6*H6","v":0},{"$f":"+G6*(1-H6)","v":0}]
["Berm",null,"m3",null,{"$error":"#N/A"},0,{"$f":"D7*F7","v":0},0,{"$f":"G7*H7","v":0},{"$f":"+G7*(1-H7)","v":0}]
["Block roads",null,"m3",null,{"$error":"#N/A"},0,{"$f":"D8*F8","v":0},0,{"$f":"G8*H8","v":0},{"$f":"+G8*(1-H8)","v":0}]
["Other",null,null,null,{"$error":"#N/A"},0,{"$f":"D9*F9","v":0},0,{"$f":"G9*H9","v":0},{"$f":"+G9*(1-H9)","v":0}]
["STABILIZE EMBANKMENT(S)"]
{"$rows_left_out":91}
{"sheet":"Rock Pile","index":6,"n_rows":87,"n_cols":11,"rows_kept":87,"cut":false,"hidden":false,"merged":[]}
["Rock Pile Name:","Doris, Madrid, Roberts Bay Rock Piles"]
[]
["ACTIVITY/MATERIAL","Notes","Unit","Quantity","Cost Code","Unit Cost","Cost","% Land","Land Cost","Water Cost","Comments"]
["STABILIZE SLOPES"]
["Grade Ore Rock Pile",null,null,null,{"$error":"#N/A"},0,{"$f":"D5*F5","v":0},1,{"$f":"G5*H5","v":0},{"$f":"+G5*(1-H5)","v":0}]
["DM_010 Doris Ore Pile","Remove all ore and place underground","m3",16652,"DRH",3.24648,54060.384960000003,1,54060.384960000003,0,"Engineer & Geo Month End Report Sign Sheet -- Jan 2013. Stockpile Survey volumes."]
["Grade Waste Rock Pile",null,null,null,{"$error":"#N/A"},0,0,1,{"$f":"G7*H7","v":0},0]
["DM_025 Doris Waste Rock Pile","Waste Rock: Remove all waste rock (Place underground or at the TIA)","m3",313394,"DRH",3.24648,1017427.35312,1,{"$f":"G8*H8","v":1017427.35312},0,"AutoCAD pad T survey"]
["DM_025 Doris Waste Rock Pile","D Material Waste Rock: Remove all waste rock (Place underground or at the TIA)","m3",16666,"DRH",3.24648,54105.835680000004,1,{"$f":"G9*H9","v":54105.835680000004},0,"AutoCAD pad T survey"]
["DM_025 Doris Waste Rock Pile","Madrid Ore Waste Rock: Remove all waste rock (Place underground or at the TIA)","m3",14177,"DRH",3.24648,46025.346960000003,1,46025.346960000003,0,"AutoCAD pad T survey"]
{"$rows_left_out":78}
{"sheet":"Chemicals","index":7,"n_rows":93,"n_cols":11,"rows_kept":93,"cut":false,"hidden":false,"merged":[[2,0,2,6]]}
["Chemicals/Soil Area Name: ","Decontaminate Oil, Fuel, and Containment Liners"]
[]
["Note:         The procedures, equipment and packaging for clean up and removal of chemicals or contaminated soils are highly dependent on the nature of the chemicals and their existing state of containment. Government guidelines should be consulted on an individual chemical basis.  Any estimate made here should be considered very rough unless specific evaluations have been conducted."]
["ACTIVITY/MATERIAL","Notes","Unit","Quantity","Cost Code","Unit Cost","Cost","% Land","Land Cost","Water Cost","Comments"]
["HAZARDOUS MATERIALS AUDIT"]
["Hazardous materials audit",null,"mandays",null,{"$f":"NA()","v":{"$error":"#N/A"}},0,{"$f":"D6*F6","v":0},null,{"$f":"G6*H6","v":0},{"$f":"+G6*(1-H6)","v":0}]
["BUILDING DECONTAMINATION & CONSOLIDATION OF HAZARDOUS MATERIALS"]
["Environmental technician/coordinator",null,"mandays",null,{"$f":"NA()","v":{"$error":"#N/A"}},0,{"$f":"D8*F8","v":0},null,{"$f":"G8*H8","v":0},{"$f":"+G8*(1-H8)","v":0}]
["Decontaminate: Oil, Fuel",null,"mandays",null,{"$f":"NA()","v":{"$error":"#N/A"}},0,0,null,{"$f":"G9*H9","v":0},{"$f":"+G9*(1-H9)","v":0}]
["DM_030 Doris Primary Vent Raise","Drain and decommission Enviro Tank","each",1,"ER2SL",12500,12500,0.5,{"$f":"G10*H10","v":6250},{"$f":"+G10*(1-H10)","v":6250},"Includes Removal Disposal"]
{"$rows_left_out":84}
{"sheet":"Bldgs & Equip","index":8,"n_rows":439,"n_cols":11,"rows_kept":439,"cut":false,"hidden":false,"merged":[]}
["Building / Equip Name:","Site Buildings",null,null,null,"Bldg / Equip #:",1]
[]
["ACTIVITY/MATERIAL","Notes","Unit","Quantity","Cost Code","Unit Cost","Cost","% Land","Land Cost","Water Cost","Comments"]
["DISPOSE MOBILE EQUIPMENT"]
["Decontaminate and ship off-site",null,"allow",null,{"$f":"NA()","v":{"$error":"#N/A"}},0,{"$f":"D5*F5","v":0},null,{"$f":"G5*H5","v":0},{"$f":"+G5*(1-H5)","v":0}]
["Decontaminate and dispose on-site",null,"allow",null,{"$f":"NA()","v":{"$error":"#N/A"}},0,{"$f":"D6*F6","v":0},null,{"$f":"G6*H6","v":0},{"$f":"+G6*(1-H6)","v":0}]
["Other",null,null,null,{"$f":"NA()","v":{"$error":"#N/A"}},0,{"$f":"D7*F7","v":0},null,{"$f":"G7*H7","v":0},{"$f":"+G7*(1-H7)","v":0}]
["REMOVE BUILDINGS AND INFRASTRUCTURE - see note below"]
["Accommodation Complex",null,null,null,null,null,{"$f":"D9*F9","v":0},null,{"$f":"G9*H9","v":0},{"$f":"+G9*(1-H9)","v":0}]
["DM_001 Doris Accommodation Complex","Decommission electrical, mechanical, heating, plumbing, etc.)","each",127,"BRUS1L",750,{"$f":"D10*F10","v":95250},1,95250,0]
{"$rows_left_out":430}
{"sheet":"Water Management","index":9,"n_rows":100,"n_cols":8,"rows_kept":100,"cut":false,"hidden":false,"merged":[]}
["Capital Expenditures and Short Term Water Treatment identified in 'Instructions' worksheet","Remove / Level Berms, Water Management , Water Treatment"]
[]
["ACTIVITY/MATERIAL","Notes","Units","Quantity","Cost Code","Unit Cost","Cost","Comments"]
["BREACH WATER PONDS & CONTAINMENT BERMS"]
["Remove/Level Berms"]
["DM_020 Doris Tank Farm","Level Containment Berm","m3",90,"SC1H",12.580110000000001,{"$f":"D6*F6","v":1132.2099000000001},"Added 2023"]
["DM_020 Doris Tank Farm","Excavate and stockpile liner protection cover","m3",3360,"SC1L",9.1983599999999992,{"$f":"D7*F7","v":30906.489599999997}]
["RB_002 Roberts Bay 20 ML Tank Farm","Breach containment berm","m3",153.99,"SC1H",12.580110000000001,1937.2111389000004]
["RB_003 Roberts Bay Quarry 1 - 5 ML Tank Facility","Breach containment berm","m3",77.759999999999991,"SC1H",12.580110000000001,978.22935359999997]
["RB_003 Roberts Bay Quarry 1 - 5 ML Tank Facility","Excavate and stockpile liner protection cover","m3",2979.9,"SC1H",12.580110000000001,37487.469789000002]
{"$rows_left_out":91}
{"sheet":"Water Treatment","index":10,"n_rows":36,"n_cols":7,"rows_kept":36,"cut":false,"hidden":false,"merged":[]}
["Water Treatment","Remove / Level Berms, Water Management , Water Treatment"]
[]
["ACTIVITY/MATERIAL","Notes","Units","Quantity","Cost Code","Unit Cost","Cost"]
["ADDITION OF REAGENTS"]
["H2O2",null,"kg",null,{"$f":"NA()","v":{"$error":"#N/A"}},0,{"$f":"D5*F5","v":0}]
["lime",null,"kg",null,{"$f":"NA()","v":{"$error":"#N/A"}},0,0]
["ferric sulphate",null,"kg",null,{"$f":"NA()","v":{"$error":"#N/A"}},0,0]
["ferrous sulphate",null,"kg",null,{"$f":"NA()","v":{"$error":"#N/A"}},0,0]
["flocculants",null,"kg",null,{"$f":"NA()","v":{"$error":"#N/A"}},0,0]
["Other",null,null,null,{"$f":"NA()","v":{"$error":"#N/A"}},0,0]
{"$rows_left_out":27}
{"sheet":"ICM","index":11,"n_rows":26,"n_cols":8,"rows_kept":26,"cut":false,"hidden":false,"merged":[]}
["Interim Care and Maintenance","Two (2) Years of Care and Maintenance and Includes Water Treatment"]
[]
["ACTIVITY/MATERIAL","Notes","Units","Quantity","Cost Code","Unit Cost","Cost","Comments"]
["INTERIM CARE & MAINTENANCE"]
["Tailings Pond Water Management",null,"m3",2000000,"TPOL",0.47344499999999995,{"$f":"D5*F5","v":946889.99999999988}]
["MN_026 Naartok Crown Pillar Recovery Trench","Haul Water from Naartok Crown Pillar Recovery Trench","m3",9499.85,"HTLSL",40,379994]
["extra personnel",null,"Hr",0,{"$f":"NA()","v":{"$error":"#N/A"}},0,0]
["-on-site caretaker",null,"Hr",3640,"LAB-USL",41.933700000000002,152638.66800000001]
["extra personnel",null,"Hr",0,{"$f":"NA()","v":{"$error":"#N/A"}},0,0]
["    -Supervisor",null,"Hr",3640,"SUPERH",124.23196800000001,452204.36352000001]
{"$rows_left_out":17}
{"sheet":"PostClosure","index":12,"n_rows":38,"n_cols":8,"rows_kept":38,"cut":false,"hidden":false,"merged":[]}
["Post-Closure Monitoring &  Maintenance:"]
[]
["ACTIVITY/MATERIAL","Notes","Units","Quantity","Cost Code","Unit Cost","Cost","Comments"]
["MONITORING & INSPECTIONS"]
["Annual geotechnical inspection","Annual for first 3 years, then year 7 and 10","each",5,"PCGASSL",45000,{"$f":"D5*F5","v":225000}]
["Survey inspection",null,"each",null,{"$f":"NA()","v":{"$error":"#N/A"}},0,0]
["Regulatory costs*","Yearly for 10 Years","each",10,"PCRGLL",25000,250000]
["Site water monitoring (AEMP and SNP)",null,"each",null,{"$f":"NA()","v":{"$error":"#N/A"}},0,0]
["- Type A Water Licence 2AM-DOH1323","annual seep sampling first 5 years, then year 7 and 10","each",7,"PCSMPLL",75000,525000]
["   - Active closure and flooding",null,"each",null,{"$f":"NA()","v":{"$error":"#N/A"}},0,0]
{"$rows_left_out":29}
{"sheet":"Mobilization","index":13,"n_rows":132,"n_cols":8,"rows_kept":132,"cut":false,"hidden":false,"merged":[]}
["Mobilization/Demobilization:"]
[]
["ACTIVITY/MATERIAL","Notes","Units","Quantity","Cost Code","Unit Cost","Cost","Comments"]
["MOBILIZE HEAVY EQUIPMENT"]
["Helicopter",null,"each",1]
["Dozers","CAT D8","each",3,"LEQMBL",16000,{"$f":"D6*F6","v":48000}]
["Excavators","CAT 330","each",1,"LEQMBL",16000,16000]
["Loader","CAT 980","each",3,"LEQMBL",16000,48000]
["Motor grader","CAT 14H","each",2,"LEQMBL",16000,32000]
["Skidder","CAT 242","each",2,"LEQMBL",16000,32000]
{"$rows_left_out":123}
{"sheet":"Estimator","index":14,"n_rows":55,"n_cols":15,"rows_kept":55,"cut":false,"hidden":false,"merged":[]}
[null,"Unit Cost Estimator",null,1,"Equipment Productivity Figures and Graphs have been reproduced from Caterpillar Performance Handbook - Edition 42 "]
[null,"EXCAVATION",null,null,null,null,"HAUL AND DUMPING",null,null,null,null,"SPREADING/DOZING"]
[null,"Productivity",null,null,null,null,"Productivity",null,null,null,null,"Productivity"]
[null,"Machine","Cat 336EL",null,null,null,"Machine","Cat 770",null,null,null,"Machine","Cat D8"]
[null,"bucket capacity",null,3.16,"m3",null,"truck capacity",null,25.1,"m3",null,"Estimate production using example curves provided or ",null,600,"m3/hr"]
[null,"fill factor",null,0.75,"%",null,"fill factor",null,0.8,"%",null,"equivalent from other supplier"]
[null,"cycle time",null,45,"seconds",null,null,null,null,null,null,"Correction factors (see table provided)"]
[null,"operator skill",null,0.8,"%",null,"load time",null,6,"min.",null,"      operator skill",null,0.75]
[null,"machine availability",null,0.83,"%",null,"haul distance",null,1.5,"km",null,"      material type, see table",null,0.8]
[null,"altitude adjustment",null,1,"%",null,"average velocity",null,20,"km/hr",null,"      slot dozing",null,1]
{"$rows_left_out":45}