{"text_format":"1","workbook":"xlsx","n_sheets":17,"sheets":["Instructions","Summary","Open Pit","UG Mine","Tailings","Rock Pile","Chemicals","Bldgs & Equip","Water Management","Water Treatment","ICM","PostClosure","Mobilization","Unit_Costs","Estimator","Tools","Sheet1"],"not_rendered":{"charts":0,"images":3,"macros":1,"external_links":1,"defined_names":216,"comments":0,"pivot_tables":0},"unopened":[],"bounds":{"document_bytes":16777216,"sheet_cells":100000,"rows_first":2000,"rows_last":500,"rows_between":2000,"halvings":0,"cell_chars":16384,"cell_head_chars":4096},"cells_cut":0,"cells_raw":0,"read":"whole","date_system":"1900"}

{"sheet":"Instructions","index":0,"n_rows":69,"n_cols":8,"rows_kept":69,"cut":false,"hidden":false,"merged":[[30,0,30,2],[31,0,31,2],[58,0,67,1],[32,0,32,1],[33,0,38,1],[39,0,46,1],[47,0,53,1],[54,0,57,1]]}
["Project Name:",null,"Reclaim Model - Overview of Program"]
[null,"AEM Meliadine Gold 2015  ","All users are urged to read the Reclaim Model User Manual - Scroll down for overview description of program.",null,null,"","",""]
[null,null,"Important!  Reclaim 7.0 works better with no other excel files open."]
[null,null,"If other excel files are open ignore run time error and proceed"]
["Reclaim Menu",null,"The default Excel menu bar has an additional tab labelled \"Add-Ins\" that provides options specific to the Reclaim Model.",null,null,"","",""]
[null,"Clear","This option deletes all input data, deletes any duplicated elements and blanks out the project name.  It also allows for segregation into land costs vs water costs if required.",null,null,"","",""]
[null,"Duplicate","This option Duplicates components of the project. E.g. if there is more than one Open Pit, use duplicate to add a second Open Pit.  Quantities for the new Open Pit are erased, but the Activities and Cost Codes are carried over from the original Open Pit.  The new Open Pit subtotal is added to the Summary page.",null,null,"","",""]
[null,"Unit Costs","This option opens a window of unit costs to provide easy reference.  NOTE:  the unit cost table has a filter in the 'UNITS' column.   You can select to only see a particular unit (eg km) or multiple units (km and m3) or all units.",null,null,"","",""]
[null,"Print All ","This option prints the Summary Worksheet, Unit Cost Worksheet, and the individual component worksheets having non-zero balances.  Individual worksheets can be printed directly using standard printing methods, such as Ctl - P.",null,null,"","",""]
[null,"Quit","Select Quit to exit the program",null,null,"","",""]
{"$rows_left_out":60}
{"sheet":"Summary","index":1,"n_rows":29,"n_cols":8,"rows_kept":29,"cut":false,"hidden":false,"merged":[]}
[null,"SUMMARY OF COSTS"]
[]
["CAPITAL COSTS","COMPONENT NAME",null,"COST",null,"LAND LIABILITY",null,"WATER LIABILITY"]
["OPEN PIT",{"$f":"IF(ISBLANK('Open Pit'!$C$1),\"\",'Open Pit'!$C$1)","v":"Tiriganiaq Pit 1"},null,{"$f":"Pit1Total","v":2781688.9649476917},null,{"$f":"Pit1LandTotal","v":0},null,{"$f":"Pit1WaterTotal","v":2781688.9648476918}]
[null,{"$f":"IF(ISBLANK('Open Pit'!$N$1),\"\",'Open Pit'!$N$1)","v":"Tiriganiaq Pit 2"},null,{"$f":"'Open Pit'!$S$65","v":54435.519679999998},null,{"$f":"'Open Pit'!$U$65","v":0},null,{"$f":"'Open Pit'!$V$65","v":54435.51958}]
["UNDERGROUND MINE",{"$f":"IF(ISBLANK('UG Mine'!$B$1),\"\",'UG Mine'!$B$1)","v":"Tiriganiaq"},null,{"$f":"UG1Total","v":969540.30981200002},null,{"$f":"UG1LandTotal","v":0},null,{"$f":"UG1WaterTotal","v":969540.30971200007}]
["TAILINGS FACILITY",{"$f":"IF(ISBLANK(Tailings!$C$1),\"\",Tailings!$C$1)","v":"Tailings Storage Facility"},null,{"$f":"Tailings1Total","v":1489584.2293339127},null,{"$f":"Tailings1LandTotal","v":0},null,{"$f":"Tailings1WaterTotal","v":1489584.2292339127}]
["ROCK PILE",{"$f":"IF(ISBLANK('Rock Pile'!$C$1),\"\",'Rock Pile'!$C$1)","v":"Waste Rock Facility East"},null,{"$f":"RP1Total","v":1E-4},null,{"$f":"RP1LandTotal","v":0},null,{"$f":"RP1WaterTotal","v":0}]
[null,{"$f":"IF(ISBLANK('Rock Pile'!$N$1),\"\",'Rock Pile'!$N$1)","v":"Waste Rock Facility West"},null,{"$f":"'Rock Pile'!$S$63","v":1E-4},null,{"$f":"'Rock Pile'!$U$63","v":0},null,{"$f":"'Rock Pile'!$V$63","v":0}]
[null,{"$f":"IF(ISBLANK('Rock Pile'!$Y$1),\"\",'Rock Pile'!$Y$1)","v":"Waste Rock Facility H19-H20"},null,{"$f":"'Rock Pile'!$AD$63","v":1E-4},null,{"$f":"'Rock Pile'!$AF$63","v":0},null,{"$f":"'Rock Pile'!$AG$63","v":0}]
{"$rows_left_out":20}
{"sheet":"Open Pit","index":2,"n_rows":66,"n_cols":22,"rows_kept":66,"cut":false,"hidden":false,"merged":[]}
[2,"Open Pit Name: ","Tiriganiaq Pit 1",null,null,null,"Pit #",1,null,null,null,null,"Open Pit Name: ","Tiriganiaq Pit 2",null,null,null,"Pit #",{"$f":"H1+1","v":2}]
[]
[null,"ACTIVITY/MATERIAL","Notes","Units","Quantity","Cost Code","Unit Cost","Cost","% Land","Land Cost","Water Cost",null,"ACTIVITY/MATERIAL","Notes","Units","Quantity","Cost Code","Unit Cost","Cost","% Land","Land Cost","Water Cost"]
[null,"CONTROL ACCESS",null,null,null,null,null,null,null,null,null,null,"CONTROL ACCESS"]
[null,"Fence",null,"m",null,{"$f":"NA()","v":{"$error":"#N/A"}},{"$f":"IF(ISNA(F5),0,INDEX(IF(UPPER(RIGHT(F5,1))=Low,UnitCostLow, IF(UPPER(RIGHT(F5,1))=High,UnitCostHigh,UnitCostSpecified)),MATCH(UPPER(LEFT(F5,LEN(F5)-1)),CostCode,0)))","v":0},{"$f":"G5*E5","v":0},null,{"$f":"H5*I5","v":0},{"$f":"H5*(1-I5)","v":0},null,"Fence",null,"m",null,{"$f":"NA()","v":{"$error":"#N/A"}},{"$f":"IF(ISNA(Q5),0,INDEX(IF(UPPER(RIGHT(Q5,1))=Low,UnitCostLow, IF(UPPER(RIGHT(Q5,1))=High,UnitCostHigh,UnitCostSpecified)),MATCH(UPPER(LEFT(Q5,LEN(Q5)-1)),CostCode,0)))","v":0},{"$f":"R5*P5","v":0},null,{"$f":"S5*T5","v":0},{"$f":"S5*(1-T5)","v":0}]
[null,"Signs",null,"each",15,"SH",37.079855999999999,{"$f":"G6*E6","v":556.19784000000004},null,{"$f":"H6*I6","v":0},{"$f":"H6*(1-I6)","v":556.19784000000004},null,"Signs",null,"each",5,"SH",37.079855999999999,{"$f":"R6*P6","v":185.39928},null,0,185.39928]
[null,"Berm at crest",null,"m3",{"$f":"2795*1*2","v":5590},"RB1H",17.05,{"$f":"G7*E7","v":95309.5},null,0,95309.5,null,"Berm at crest",null,"m3",{"$f":"1188*1*2","v":2376},"RB1H",17.05,{"$f":"R7*P7","v":40510.800000000003},null,0,40510.800000000003]
[null,"Block roads",null,"m3",{"$f":"3*3*1.14*40","v":410.4},"RB1H",17.05,{"$f":"G8*E8","v":6997.32},null,0,6997.32,null,"Block roads",null,"m3",{"$f":"3*3*1.14*40","v":410.4},"RB1H",17.05,{"$f":"R8*P8","v":6997.32},null,0,6997.32]
[null,"Other",null,null,null,{"$f":"NA()","v":{"$error":"#N/A"}},{"$f":"IF(ISNA(F9),0,INDEX(IF(UPPER(RIGHT(F9,1))=Low,UnitCostLow, IF(UPPER(RIGHT(F9,1))=High,UnitCostHigh,UnitCostSpecified)),MATCH(UPPER(LEFT(F9,LEN(F9)-1)),CostCode,0)))","v":0},{"$f":"G9*E9","v":0},null,{"$f":"H9*I9","v":0},{"$f":"H9*(1-I9)","v":0},null,"Other",null,null,null,{"$f":"NA()","v":{"$error":"#N/A"}},{"$f":"IF(ISNA(Q9),0,INDEX(IF(UPPER(RIGHT(Q9,1))=Low,UnitCostLow, IF(UPPER(RIGHT(Q9,1))=High,UnitCostHigh,UnitCostSpecified)),MATCH(UPPER(LEFT(Q9,LEN(Q9)-1)),CostCode,0)))","v":0},{"$f":"R9*P9","v":0},null,{"$f":"S9*T9","v":0},{"$f":"S9*(1-T9)","v":0}]
[null,"STABILITY STUDY",null,null,null,null,null,null,null,null,null,null,"STABILITY STUDY"]
{"$rows_left_out":57}
{"sheet":"UG Mine","index":3,"n_rows":46,"n_cols":10,"rows_kept":46,"cut":false,"hidden":false,"merged":[]}
["Underground Mine Name","Tiriganiaq",null,null,null,"UG Mine #",1]
[]
["ACTIVITY/MATERIAL","Notes","Unit","Qty","Cost Code","Unit Cost","Cost","% Land","Land Cost","Water Cost"]
["CONTROL ACCESS"]
["Fence",null,"m",null,{"$f":"NA()","v":{"$error":"#N/A"}},{"$f":"IF(ISNA(E5),0,INDEX(IF(UPPER(RIGHT(E5,1))=Low,UnitCostLow, IF(UPPER(RIGHT(E5,1))=High,UnitCostHigh,UnitCostSpecified)),MATCH(UPPER(LEFT(E5,LEN(E5)-1)),CostCode,0)))","v":0},{"$f":"F5*D5","v":0},null,{"$f":"G5*H5","v":0},{"$f":"G5*(1-H5)","v":0}]
["Signs",null,"each",2,"SH",37.079855999999999,74.159711999999999,null,{"$f":"G6*H6","v":0},{"$f":"G6*(1-H6)","v":74.159711999999999}]
["Block roads",null,"m3",null,{"$f":"NA()","v":{"$error":"#N/A"}},0,{"$f":"F7*D7","v":0},null,0,0]
["Berm",null,"m3",{"$f":"250*3*3*1.14","v":2565},"RB1H",17.05,43733.25,null,0,43733.25]
["Concrete wall in  portals",null,"m3",null,{"$f":"NA()","v":{"$error":"#N/A"}},{"$f":"IF(ISNA(E9),0,INDEX(IF(UPPER(RIGHT(E9,1))=Low,UnitCostLow, IF(UPPER(RIGHT(E9,1))=High,UnitCostHigh,UnitCostSpecified)),MATCH(UPPER(LEFT(E9,LEN(E9)-1)),CostCode,0)))","v":0},0,null,{"$f":"G9*H9","v":0},{"$f":"G9*(1-H9)","v":0}]
["Cap bulkhead, pit portal",null,"each",2,"MBK",79590.600000000006,{"$f":"F10*D10","v":159181.20000000001},null,{"$f":"G10*H10","v":0},{"$f":"G10*(1-H10)","v":159181.20000000001}]
{"$rows_left_out":37}
{"sheet":"Tailings","index":4,"n_rows":80,"n_cols":11,"rows_kept":80,"cut":false,"hidden":false,"merged":[]}
[1,"Tailings Impoundment Name:","Tailings Storage Facility",null,null,null,"Pond #",1]
[]
[null,"ACTIVITY/MATERIAL","Notes","Units","Quantity","Cost Code","Unit Cost","Cost","% Land","Land Cost","Water Cost"]
[null,"CONTROL ACCESS"]
[null,"Fence",null,"m",null,{"$f":"NA()","v":{"$error":"#N/A"}},{"$f":"IF(ISNA(F5),0,INDEX(IF(UPPER(RIGHT(F5,1))=Low,UnitCostLow, IF(UPPER(RIGHT(F5,1))=High,UnitCostHigh,UnitCostSpecified)),MATCH(UPPER(LEFT(F5,LEN(F5)-1)),CostCode,0)))","v":0},{"$f":"G5*E5","v":0},null,{"$f":"H5*I5","v":0},{"$f":"+H5*(1-I5)","v":0}]
[null,"Signs",null,"each",null,{"$f":"NA()","v":{"$error":"#N/A"}},0,0,null,{"$f":"H6*I6","v":0},{"$f":"+H6*(1-I6)","v":0}]
[null,"Berm",null,"m3",null,{"$f":"NA()","v":{"$error":"#N/A"}},0,0,null,0,0]
[null,"Block roads",null,"m3",null,{"$f":"NA()","v":{"$error":"#N/A"}},0,0,null,0,0]
[null,"Other",null,null,null,{"$f":"NA()","v":{"$error":"#N/A"}},0,0,null,0,0]
[null,"STABILIZE EMBANKMENT(S)"]
{"$rows_left_out":71}
{"sheet":"Rock Pile","index":5,"n_rows":67,"n_cols":33,"rows_kept":67,"cut":false,"hidden":false,"merged":[]}
[3,"Rock Pile Name:","Waste Rock Facility East",null,null,null,null,null,null,null,null,null,"Rock Pile Name:","Waste Rock Facility West",null,null,null,null,{"$f":"H1+1","v":1},null,null,null,null,"Rock Pile Name:","Waste Rock Facility H19-H20",null,null,null,null,{"$f":"S1+1","v":2}]
[]
[null,"ACTIVITY/MATERIAL","Notes","Units","Quantity","Cost Code","Unit Cost","Cost","% Land","Land Cost","Water Cost",null,"ACTIVITY/MATERIAL","Notes","Units","Quantity","Cost Code","Unit Cost","Cost","% Land","Land Cost","Water Cost",null,"ACTIVITY/MATERIAL","Notes","Units","Quantity","Cost Code","Unit Cost","Cost","% Land","Land Cost","Water Cost"]
[null,"STABILIZE SLOPES",null,null,null,null,null,null,null,null,null,null,"STABILIZE SLOPES",null,null,null,null,null,null,null,null,null,null,"STABILIZE SLOPES"]
[null,"Flatten slopes with dozer",null,"m3",null,{"$f":"NA()","v":{"$error":"#N/A"}},{"$f":"IF(ISNA(F5),0,INDEX(IF(UPPER(RIGHT(F5,1))=Low,UnitCostLow, IF(UPPER(RIGHT(F5,1))=High,UnitCostHigh,UnitCostSpecified)),MATCH(UPPER(LEFT(F5,LEN(F5)-1)),CostCode,0)))","v":0},{"$f":"G5*E5","v":0},null,{"$f":"H5*I5","v":0},{"$f":"+H5*(1-I5)","v":0},null,"Flatten slopes with dozer",null,"m3",null,{"$f":"NA()","v":{"$error":"#N/A"}},{"$f":"IF(ISNA(Q5),0,INDEX(IF(UPPER(RIGHT(Q5,1))=Low,UnitCostLow, IF(UPPER(RIGHT(Q5,1))=High,UnitCostHigh,UnitCostSpecified)),MATCH(UPPER(LEFT(Q5,LEN(Q5)-1)),CostCode,0)))","v":0},{"$f":"R5*P5","v":0},null,{"$f":"S5*T5","v":0},{"$f":"+S5*(1-T5)","v":0},null,"Flatten slopes with dozer",null,"m3",null,{"$f":"NA()","v":{"$error":"#N/A"}},{"$f":"IF(ISNA(AB5),0,INDEX(IF(UPPER(RIGHT(AB5,1))=Low,UnitCostLow, IF(UPPER(RIGHT(AB5,1))=High,UnitCostHigh,UnitCostSpecified)),MATCH(UPPER(LEFT(AB5,LEN(AB5)-1)),CostCode,0)))","v":0},{"$f":"AC5*AA5","v":0},null,{"$f":"AD5*AE5","v":0},{"$f":"+AD5*(1-AE5)","v":0}]
[null,"Flatten \"bubble dump\" areas",null,"m3",null,{"$f":"NA()","v":{"$error":"#N/A"}},0,0,null,0,0,null,"Flatten \"bubble dump\" areas",null,"m3",null,{"$f":"NA()","v":{"$error":"#N/A"}},0,0,null,0,0,null,"Flatten \"bubble dump\" areas",null,"m3",null,{"$f":"NA()","v":{"$error":"#N/A"}},0,0,null,0,0]
[null,"Divert runon, ditch mat'l A",null,"m3",null,{"$f":"NA()","v":{"$error":"#N/A"}},0,0,null,0,0,null,"Divert runon, ditch mat'l A",null,"m3",null,{"$f":"NA()","v":{"$error":"#N/A"}},0,0,null,0,0,null,"Divert runon, ditch mat'l A",null,"m3",null,{"$f":"NA()","v":{"$error":"#N/A"}},0,0,null,0,0]
[null,"Divert runon, ditch mat'l B",null,"m3",null,{"$f":"NA()","v":{"$error":"#N/A"}},0,0,null,0,0,null,"Divert runon, ditch mat'l B",null,"m3",null,{"$f":"NA()","v":{"$error":"#N/A"}},0,0,null,0,0,null,"Divert runon, ditch mat'l B",null,"m3",null,{"$f":"NA()","v":{"$error":"#N/A"}},0,0,null,0,0]
[null,"Toe buttress, drain mat'l",null,"m3",null,{"$f":"NA()","v":{"$error":"#N/A"}},0,0,null,0,0,null,"Toe buttress, drain mat'l",null,"m3",null,{"$f":"NA()","v":{"$error":"#N/A"}},0,0,null,0,0,null,"Toe buttress, drain mat'l",null,"m3",null,{"$f":"NA()","v":{"$error":"#N/A"}},0,0,null,0,0]
[null,"Toe buttress, fill mat'l A",null,"m3",null,{"$f":"NA()","v":{"$error":"#N/A"}},0,0,null,0,0,null,"Toe buttress, fill mat'l A",null,"m3",null,{"$f":"NA()","v":{"$error":"#N/A"}},0,0,null,0,0,null,"Toe buttress, fill mat'l A",null,"m3",null,{"$f":"NA()","v":{"$error":"#N/A"}},0,0,null,0,0]
{"$rows_left_out":58}
{"sheet":"Chemicals","index":6,"n_rows":55,"n_cols":10,"rows_kept":55,"cut":false,"hidden":false,"merged":[[2,0,2,6]]}
["Chemicals/Soil Area Name:"]
[]
["Note:         The procedures, equipment and packaging for clean up and removal of chemicals or contaminated soils are highly dependent on the nature of the chemicals and their existing state of containment. Government guidelines should be consulted on an individual chemical basis.  Any estimate made here should be considered very rough unless specific evaluations have been conducted."]
["ACTIVITY/MATERIAL","Notes","Units","Quantity","Cost Code","Unit Cost","Cost","% Land","Land Cost","Water Cost"]
["HAZARDOUS MATERIALS AUDIT"]
["Hazardous materials audit",null,"mandays",null,{"$f":"NA()","v":{"$error":"#N/A"}},{"$f":"IF(ISNA(E6),0,INDEX(IF(UPPER(RIGHT(E6,1))=Low,UnitCostLow, IF(UPPER(RIGHT(E6,1))=High,UnitCostHigh,UnitCostSpecified)),MATCH(UPPER(LEFT(E6,LEN(E6)-1)),CostCode,0)))","v":0},{"$f":"F6*D6","v":0},null,{"$f":"G6*H6","v":0},{"$f":"+G6*(1-H6)","v":0}]
["Phase 1 audit",null,"each",1,"MBK",7500,{"$f":"F7*D7","v":7500},null,{"$f":"G7*H7","v":0},{"$f":"+G7*(1-H7)","v":7500}]
["Phase 2 audit",null,"each",1,"MBK",50000,50000,null,0,50000]
["BUILDING DECONTAMINATION & CONSOLIDATION OF HAZARDOUS MATERIALS"]
["Environmental technician/coordinator",null,"mandays",null,{"$f":"NA()","v":{"$error":"#N/A"}},{"$f":"IF(ISNA(E10),0,INDEX(IF(UPPER(RIGHT(E10,1))=Low,UnitCostLow, IF(UPPER(RIGHT(E10,1))=High,UnitCostHigh,UnitCostSpecified)),MATCH(UPPER(LEFT(E10,LEN(E10)-1)),CostCode,0)))","v":0},{"$f":"F10*D10","v":0},null,{"$f":"G10*H10","v":0},{"$f":"+G10*(1-H10)","v":0}]
{"$rows_left_out":46}
{"sheet":"Bldgs & Equip","index":7,"n_rows":85,"n_cols":11,"rows_kept":85,"cut":false,"hidden":false,"merged":[]}
[1,"Building / Equip Name:",null,null,null,null,"Bldg / Equip #:",1]
[]
[null,"ACTIVITY/MATERIAL","Notes","Units","Quantity","Cost Code","Unit Cost","Cost","% Land","Land Cost","Water Cost"]
[null,"DISPOSE MOBILE EQUIPMENT"]
[null,"Decontaminate and ship off-site",null,"tonne",{"$f":"55000/2","v":27500},"AEM",383.12,{"$f":"G5*E5","v":10535800},null,{"$f":"H5*I5","v":0},{"$f":"+H5*(1-I5)","v":10535800}]
[null,"Decontaminate and dispose on-site",null,"tonne",{"$f":"55000/2","v":27500},"AEM",5,{"$f":"G6*E6","v":137500},null,{"$f":"H6*I6","v":0},{"$f":"+H6*(1-I6)","v":137500}]
[null,"Salvage Value",null,"tonne",0,"AEM",-383.12,{"$f":"G7*E7","v":0},null,0,0]
[null,"Other",null,null,null,{"$f":"NA()","v":{"$error":"#N/A"}},{"$f":"IF(ISNA(F8),0,INDEX(IF(UPPER(RIGHT(F8,1))=Low,UnitCostLow, IF(UPPER(RIGHT(F8,1))=High,UnitCostHigh,UnitCostSpecified)),MATCH(UPPER(LEFT(F8,LEN(F8)-1)),CostCode,0)))","v":0},{"$f":"G8*E8","v":0},null,{"$f":"H8*I8","v":0},{"$f":"+H8*(1-I8)","v":0}]
[null,"REMOVE BUILDINGS - see note below"]
[null,"Accomodation Complex (incl dorms, corridors, kitchen, laundry, dry, rec hall, ERT)",null,"m2",{"$f":"8232.89+1787.26+1189.76+3547.89+3347.07+678.9","v":18783.77},"BRS1L",45,{"$f":"G10*E10","v":845269.65},null,0,845269.65]
{"$rows_left_out":76}
{"sheet":"Water Management","index":8,"n_rows":56,"n_cols":8,"rows_kept":56,"cut":false,"hidden":false,"merged":[]}
[1,"Capital Expenditures and Short Term Water Treatment identified in 'Instructions' worksheet"]
[]
[null,"ACTIVITY/MATERIAL","Notes","Units","Quantity","Cost Code","Unit Cost","Cost"]
[null,"BREACH DYKE EMBANKMENT"]
[null,"Remove (Excavate) fill",null,"m3",{"$f":"(150000)*0.1","v":15000},"AEM",8.4700000000000006,{"$f":"G5*E5","v":127050.00000000001}]
[null,"Contour water intake area",null,"m3",null,{"$f":"NA()","v":{"$error":"#N/A"}},{"$f":"IF(ISNA(F6),0,INDEX(IF(UPPER(RIGHT(F6,1))=Low,UnitCostLow, IF(UPPER(RIGHT(F6,1))=High,UnitCostHigh,UnitCostSpecified)),MATCH(UPPER(LEFT(F6,LEN(F6)-1)),CostCode,0)))","v":0},{"$f":"G6*E6","v":0}]
[null,"STABILIZE SEDIMENT PONDS/WATER MANAGEMENT PONDS"]
[null,"Place soil cover",null,"m3",null,{"$f":"NA()","v":{"$error":"#N/A"}},{"$f":"IF(ISNA(F8),0,INDEX(IF(UPPER(RIGHT(F8,1))=Low,UnitCostLow, IF(UPPER(RIGHT(F8,1))=High,UnitCostHigh,UnitCostSpecified)),MATCH(UPPER(LEFT(F8,LEN(F8)-1)),CostCode,0)))","v":0},{"$f":"G8*E8","v":0}]
[null,"Doze & spread excavated material",null,"m3",null,{"$f":"NA()","v":{"$error":"#N/A"}},{"$f":"IF(ISNA(F9),0,INDEX(IF(UPPER(RIGHT(F9,1))=Low,UnitCostLow, IF(UPPER(RIGHT(F9,1))=High,UnitCostHigh,UnitCostSpecified)),MATCH(UPPER(LEFT(F9,LEN(F9)-1)),CostCode,0)))","v":0},{"$f":"G9*E9","v":0}]
[null,"Vegetate spread material",null,"ha",null,{"$f":"NA()","v":{"$error":"#N/A"}},{"$f":"IF(ISNA(F10),0,INDEX(IF(UPPER(RIGHT(F10,1))=Low,UnitCostLow, IF(UPPER(RIGHT(F10,1))=High,UnitCostHigh,UnitCostSpecified)),MATCH(UPPER(LEFT(F10,LEN(F10)-1)),CostCode,0)))","v":0},{"$f":"G10*E10","v":0}]
{"$rows_left_out":47}
{"sheet":"Water Treatment","index":9,"n_rows":36,"n_cols":8,"rows_kept":36,"cut":false,"hidden":false,"merged":[]}
[1,"Post Closure Water Treatment - Identified as long term/post-closure in 'Instructions' worksheet"]
[]
[null,"ACTIVITY/MATERIAL","Notes","Units","Quantity","Cost Code","Unit Cost","Cost"]
[null,"ADDITION OF REAGENTS TO WTP"]
[null,"H2O2",null,"kg",null,{"$f":"NA()","v":{"$error":"#N/A"}},{"$f":"IF(ISNA(F5),0,INDEX(IF(UPPER(RIGHT(F5,1))=Low,UnitCostLow, IF(UPPER(RIGHT(F5,1))=High,UnitCostHigh,UnitCostSpecified)),MATCH(UPPER(LEFT(F5,LEN(F5)-1)),CostCode,0)))","v":0},{"$f":"G5*E5","v":0}]
[null,"lime",null,"kg",null,{"$f":"NA()","v":{"$error":"#N/A"}},0,0]
[null,"ferric sulphate",null,"kg",null,{"$f":"NA()","v":{"$error":"#N/A"}},0,0]
[null,"ferrous sulphate",null,"kg",null,{"$f":"NA()","v":{"$error":"#N/A"}},0,0]
[null,"flocculents",null,"kg",null,{"$f":"NA()","v":{"$error":"#N/A"}},0,0]
[null,"Other",null,null,null,{"$f":"NA()","v":{"$error":"#N/A"}},0,0]
{"$rows_left_out":27}
{"sheet":"ICM","index":10,"n_rows":21,"n_cols":8,"rows_kept":21,"cut":false,"hidden":false,"merged":[]}
[1,"Interim Care and Maintenance"]
[]
[null,"ACTIVITY/MATERIAL","Notes","Units","Quantity","Cost Code","Unit Cost","Cost"]
[null,"INTERIM CARE & MAINTENANCE"]
[null,"on-site caretaker",null,"manmonths",null,{"$f":"NA()","v":{"$error":"#N/A"}},{"$f":"IF(ISNA(F5),0,INDEX(IF(UPPER(RIGHT(F5,1))=Low,UnitCostLow, IF(UPPER(RIGHT(F5,1))=High,UnitCostHigh,UnitCostSpecified)),MATCH(UPPER(LEFT(F5,LEN(F5)-1)),CostCode,0)))","v":0},{"$f":"G5*E5","v":0}]
[null,"extra personnel",null,"manmonths",null,{"$f":"NA()","v":{"$error":"#N/A"}},0,0]
[null,"    -electrician",null,"manmonths",null,{"$f":"NA()","v":{"$error":"#N/A"}},{"$f":"IF(ISNA(F7),0,INDEX(IF(UPPER(RIGHT(F7,1))=Low,UnitCostLow, IF(UPPER(RIGHT(F7,1))=High,UnitCostHigh,UnitCostSpecified)),MATCH(UPPER(LEFT(F7,LEN(F7)-1)),CostCode,0)))","v":0},{"$f":"G7*E7","v":0}]
[null,"    -mechanic",null,"manmonths",null,{"$f":"NA()","v":{"$error":"#N/A"}},{"$f":"IF(ISNA(F8),0,INDEX(IF(UPPER(RIGHT(F8,1))=Low,UnitCostLow, IF(UPPER(RIGHT(F8,1))=High,UnitCostHigh,UnitCostSpecified)),MATCH(UPPER(LEFT(F8,LEN(F8)-1)),CostCode,0)))","v":0},{"$f":"G8*E8","v":0}]
[null,"annual fuel",null,"litre",null,{"$f":"NA()","v":{"$error":"#N/A"}},0,0]
[null,"misc. supplies",null,"allow",null,{"$f":"NA()","v":{"$error":"#N/A"}},{"$f":"IF(ISNA(F10),0,INDEX(IF(UPPER(RIGHT(F10,1))=Low,UnitCostLow, IF(UPPER(RIGHT(F10,1))=High,UnitCostHigh,UnitCostSpecified)),MATCH(UPPER(LEFT(F10,LEN(F10)-1)),CostCode,0)))","v":0},{"$f":"G10*E10","v":0}]
{"$rows_left_out":12}
{"sheet":"PostClosure","index":11,"n_rows":37,"n_cols":8,"rows_kept":37,"cut":false,"hidden":false,"merged":[]}
[1,"Post-Closure Monitoring &  Maintenance:"]
[]
[null,"ACTIVITY/MATERIAL","Notes","Units","Quantity","Cost Code","Unit Cost","Cost"]
[null,"MONITORING & INSPECTIONS"]
[null,"Annual geotechnical inspection",null,"each",1,"VIH",{"$f":"IF(ISNA(F5),0,INDEX(IF(UPPER(RIGHT(F5,1))=Low,UnitCostLow, IF(UPPER(RIGHT(F5,1))=High,UnitCostHigh,UnitCostSpecified)),MATCH(UPPER(LEFT(F5,LEN(F5)-1)),CostCode,0)))","v":7977.7872000000007},{"$f":"G5*E5","v":7977.7872000000007}]
[null,"Surface water sampling",null,"each",1,"WSH",{"$f":"IF(ISNA(F6),0,INDEX(IF(UPPER(RIGHT(F6,1))=Low,UnitCostLow, IF(UPPER(RIGHT(F6,1))=High,UnitCostHigh,UnitCostSpecified)),MATCH(UPPER(LEFT(F6,LEN(F6)-1)),CostCode,0)))","v":10000},{"$f":"G6*E6","v":10000}]
[null,"Groundwater Sampling",null,"each",1,"WSH",10000,10000]
[null,"Receiving/downstream water sampling",null,"each",1,"WSH",10000,10000]
[null,"Monitoring program as per plan",null,"each",0.5,"AEM",100000,50000]
[null,"Survey inspection",null,"each",null,{"$f":"NA()","v":{"$error":"#N/A"}},0,0]
{"$rows_left_out":28}
{"sheet":"Mobilization","index":12,"n_rows":60,"n_cols":7,"rows_kept":60,"cut":false,"hidden":false,"merged":[]}
["Mobilization/Demobilization:"]
[]
["ACTIVITY/MATERIAL","Notes","Units","Quantity","Cost Code","Unit Cost","Cost"]
["MOBILIZE HEAVY EQUIPMENT"]
["Excavators",null,"each",null,{"$f":"NA()","v":{"$error":"#N/A"}},{"$f":"IF(ISNA(E5),0,INDEX(IF(UPPER(RIGHT(E5,1))=Low,UnitCostLow, IF(UPPER(RIGHT(E5,1))=High,UnitCostHigh,UnitCostSpecified)),MATCH(UPPER(LEFT(E5,LEN(E5)-1)),CostCode,0)))","v":0},{"$f":"F5*D5","v":0}]
["Dump trucks",null,"each",null,{"$f":"NA()","v":{"$error":"#N/A"}},0,0]
["Dozers",null,"each",null,{"$f":"NA()","v":{"$error":"#N/A"}},0,0]
["Demolition shears",null,"each",1,"AEM",1000000,1000000]
["Crane",null,"each",null,{"$f":"NA()","v":{"$error":"#N/A"}},0,0]
["Loader",null,"each",null,{"$f":"NA()","v":{"$error":"#N/A"}},0,{"$f":"F10*D10","v":0}]
{"$rows_left_out":51}
{"sheet":"Unit_Costs","index":13,"n_rows":180,"n_cols":12,"rows_kept":180,"cut":false,"hidden":false,"merged":[]}
["Unit Cost Table (for refining unit costs see \"Estimator\" worksheet)"]
[null,null,null,"Filter by unit",null,"",""]
[null,null,null,null,null,"","",""]
["ITEM","Detail",null,"COST CODE","UNITS","LOW $","HIGH $","SPECIFIED $",null,"COMMENTS"]
[null,null,null,null,null,"","",""]
["Accomodation"]
[null,null,null,"ACCM","manday",100,175]
["Buildings - Decontaminate",null,null,null,null,"","",""]
[null,"Asbestos",null,"BDA","m2",25.6,51.2,null,null,"Low: removal of asbestos siding & flooring; High: removal of insulated pipes, friable asbestos"]
["Buildings - Remove",null,null,null,null,"","","",null,"Unit costs are based on 3m high, single storey building.  Scale areas accordingly."]
{"$rows_left_out":171}
{"sheet":"Estimator","index":14,"n_rows":55,"n_cols":15,"rows_kept":55,"cut":false,"hidden":false,"merged":[]}
[null,"Unit Cost Estimator",null,1,"Equipment Productivity Figures and Graphs have been reproduced from Caterpillar Performance Handbook - Edition 42 "]
[null,"EXCAVATION",null,null,null,null,"HAUL AND DUMPING",null,null,null,null,"SPREADING/DOZING"]
[null,"Productivity",null,null,null,null,"Productivity",null,null,null,null,"Productivity"]
[null,"Machine","Cat 336EL",null,null,null,"Machine","Cat 770",null,null,null,"Machine","Cat D8"]
[null,"bucket capacity",null,3.16,"m3",null,"truck capacity",null,25.1,"m3",null,"Estimate production using example curves provided or ",null,600,"m3/hr"]
[null,"fill factor",null,0.75,"%",null,"fill factor",null,0.8,"%",null,"equivalent from other supplier"]
[null,"cycle time",null,45,"seconds",null,null,null,null,null,null,"Correction factors (see table provided)"]
[null,"operator skill",null,0.8,"%",null,"load time",null,6,"min.",null,"      operator skill",null,0.75]
[null,"machine availability",null,0.83,"%",null,"haul distance",null,1.5,"km",null,"      material type, see table",null,0.8]
[null,"altitude adjustment",null,1,"%",null,"average velocity",null,20,"km/hr",null,"      slot dozing",null,1]
{"$rows_left_out":46}
{"sheet":"Tools","index":15,"n_rows":12,"n_cols":12,"rows_kept":12,"cut":false,"hidden":false,"merged":[]}
["The functions in this worksheet serve as a back up in the event that the menu item \"Add-Ins\" is not shown in Excel menu bar"]
[]
[]
[null,null,"Save file before clearing all data"]
[]
[null,null,null,null,null,null,null,null,null,null,null,"These functions duplicate components within worksheet"]
[]
[]
[null,null,"Shows both active worksheet as well as table of Unit Costs in a separate window"]
[]
{"$rows_left_out":3}
{"sheet":"Sheet1","index":16,"n_rows":0,"n_cols":0,"rows_kept":0,"cut":false,"hidden":false,"merged":[]}