{"text_format":"1","workbook":"xlsx","n_sheets":19,"sheets":["Instructions","Summary","Open Pit","Rock Pile","Chemicals","Bldgs & Equip","Bldgs & Equip (2)","Bldgs & Equip (3)","Bldgs & Equip (4)","Water Management","ICM","PostClosure","Mobilization","UG Mine","Tailings","Water Treatment","Unit_Costs","Estimator","Tools"],"not_rendered":{"charts":0,"images":3,"macros":1,"external_links":0,"defined_names":156,"comments":0,"pivot_tables":0},"unopened":[],"bounds":{"document_bytes":16777216,"sheet_cells":100000,"rows_first":2000,"rows_last":500,"rows_between":2000,"halvings":0,"cell_chars":16384,"cell_head_chars":4096},"cells_cut":0,"cells_raw":0,"read":"whole","date_system":"1900"}

{"sheet":"Instructions","index":0,"n_rows":69,"n_cols":8,"rows_kept":69,"cut":false,"hidden":false,"merged":[[58,0,67,1],[32,0,32,1],[33,0,38,1],[39,0,46,1],[47,0,53,1],[54,0,57,1]]}
["Project Name:",null,"Reclaim Model - Overview of Program"]
[null,"Baffinland Iron Mine (Bas","All users are urged to read the Reclaim Model User Manual - Scroll down for overview description of program.",null,null,"","",""]
[null,null,"Important!  Reclaim 7.0 works better with no other excel files open."]
[null,null,"If other excel files are open ignore run time error and proceed"]
["Reclaim Menu",null,"The default Excel menu bar has an additional tab labelled \"Add-Ins\" that provides options specific to the Reclaim Model.",null,null,"","",""]
[null,"Clear","This option deletes all input data, deletes any duplicated elements and blanks out the project name.  It also allows for segregation into land costs vs water costs if required.",null,null,"","",""]
[null,"Duplicate","This option Duplicates components of the project. E.g. if there is more than one Open Pit, use duplicate to add a second Open Pit.  Quantities for the new Open Pit are erased, but the Activities and Cost Codes are carried over from the original Open Pit.  The new Open Pit subtotal is added to the Summary page.",null,null,"","",""]
[null,"Unit Costs","This option opens a window of unit costs to provide easy reference.  NOTE:  the unit cost table has a filter in the 'UNITS' column.   You can select to only see a particular unit (eg km) or multiple units (km and m3) or all units.",null,null,"","",""]
{"$rows_left_out":62}
{"sheet":"Summary","index":1,"n_rows":29,"n_cols":11,"rows_kept":29,"cut":false,"hidden":false,"merged":[]}
[" ","SUMMARY OF COSTS"]
[]
["CAPITAL COSTS","COMPONENT NAME",null,"COST",null,"LAND LIABILITY",null,"WATER LIABILITY","IOL     LIABILITY",null,"CROWN LIABILITY"]
["OPEN PIT",{"$f":"IF(ISBLANK('Open Pit'!$C$1),\"\",'Open Pit'!$C$1)","v":"Mary River Mine Pit"},null,{"$f":"Pit1Total","v":4808915.6923069144},null,{"$f":"Pit1LandTotal","v":4808915.6922069145},null,{"$f":"Pit1WaterTotal","v":0},{"$f":"D4-K4","v":4692697.7209986681},null,{"$f":"'Open Pit'!J53+'Open Pit'!J59","v":116217.9713082463}]
["UNDERGROUND MINE",{"$f":"IF(ISBLANK('UG Mine'!$C$1),\"\",'UG Mine'!$C$1)","v":""},null,{"$f":"UG1Total","v":1E-4},null,{"$f":"UG1LandTotal","v":0},null,{"$f":"UG1WaterTotal","v":0},{"$f":"D5-K5","v":1E-4},null,0]
["TAILINGS FACILITY",{"$f":"IF(ISBLANK(Tailings!$C$1),\"\",Tailings!$C$1)","v":""},null,{"$f":"Tailings1Total","v":1E-4},null,{"$f":"Tailings1LandTotal","v":0},null,{"$f":"Tailings1WaterTotal","v":0},1E-4,null,0]
["ROCK PILE",{"$f":"IF(ISBLANK('Rock Pile'!$C$1),\"\",'Rock Pile'!$C$1)","v":"Mine Site Waste Rock Pile"},null,{"$f":"RP1Total","v":283749.86579733744},null,{"$f":"RP1LandTotal","v":283749.86569733743},null,{"$f":"RP1WaterTotal","v":0},283749.86579733744,null,0]
["BUILDINGS AND EQUIPMENT",{"$f":"IF(ISBLANK('Bldgs & Equip'!$C$1),\"\",'Bldgs & Equip'!$C$1)","v":"Mine Site"},null,{"$f":"Bldg1Total","v":11894285.425635392},null,{"$f":"Bldg1LandTotal","v":11635930.985535393},null,{"$f":"Bldg1WaterTotal","v":258354.44000000006},11894285.425635392,null,0]
{"$rows_left_out":22}
{"sheet":"Open Pit","index":2,"n_rows":91,"n_cols":13,"rows_kept":91,"cut":false,"hidden":false,"merged":[]}
[1,"Open Pit Name: ","Mary River Mine Pit",null,null,null,"Pit #",1]
[]
[null,"ACTIVITY/MATERIAL","Notes","Units","Quantity","Cost Code","Unit Cost","Cost","% Land","Land Cost","Water Cost"]
[null,"CONTROL ACCESS"]
[null,"Fence",null,"m",null,{"$f":"NA()","v":{"$error":"#N/A"}},{"$f":"IF(ISNA(F5),0,INDEX(IF(UPPER(RIGHT(F5,1))=Low,UnitCostLow, IF(UPPER(RIGHT(F5,1))=High,UnitCostHigh,UnitCostSpecified)),MATCH(UPPER(LEFT(F5,LEN(F5)-1)),CostCode,0)))","v":0},{"$f":"G5*E5","v":0},null,{"$f":"H5*I5","v":0},{"$f":"H5*(1-I5)","v":0}]
[null,"Signs",null,"each",null,"SH",37.08,{"$f":"G6*E6","v":0},null,{"$f":"H6*I6","v":0},{"$f":"H6*(1-I6)","v":0}]
[null,"Berm at crest",null,"m3",null,{"$f":"NA()","v":{"$error":"#N/A"}},{"$f":"IF(ISNA(F7),0,INDEX(IF(UPPER(RIGHT(F7,1))=Low,UnitCostLow, IF(UPPER(RIGHT(F7,1))=High,UnitCostHigh,UnitCostSpecified)),MATCH(UPPER(LEFT(F7,LEN(F7)-1)),CostCode,0)))","v":0},{"$f":"G7*E7","v":0},null,{"$f":"H7*I7","v":0},{"$f":"H7*(1-I7)","v":0}]
[null,"Block roads",null,"m3",null,"RB1H",{"$f":"IF(ISNA(F8),0,INDEX(IF(UPPER(RIGHT(F8,1))=Low,UnitCostLow, IF(UPPER(RIGHT(F8,1))=High,UnitCostHigh,UnitCostSpecified)),MATCH(UPPER(LEFT(F8,LEN(F8)-1)),CostCode,0)))","v":17.05},{"$f":"G8*E8","v":0},null,{"$f":"H8*I8","v":0},{"$f":"H8*(1-I8)","v":0}]
{"$rows_left_out":84}
{"sheet":"Rock Pile","index":3,"n_rows":68,"n_cols":11,"rows_kept":68,"cut":false,"hidden":false,"merged":[]}
[1,"Rock Pile Name:","Mine Site Waste Rock Pile"]
[]
[null,"ACTIVITY/MATERIAL","Notes","Units","Quantity","Cost Code","Unit Cost","Cost","% Land","Land Cost","Water Cost"]
[null,"STABILIZE SLOPES"]
[null,"Flatten slopes with dozer",null,"m3",null,{"$f":"NA()","v":{"$error":"#N/A"}},{"$f":"IF(ISNA(F5),0,INDEX(IF(UPPER(RIGHT(F5,1))=Low,UnitCostLow, IF(UPPER(RIGHT(F5,1))=High,UnitCostHigh,UnitCostSpecified)),MATCH(UPPER(LEFT(F5,LEN(F5)-1)),CostCode,0)))","v":0},{"$f":"G5*E5","v":0},null,{"$f":"H5*I5","v":0},{"$f":"+H5*(1-I5)","v":0}]
[null,"Flatten \"bubble dump\" areas",null,"m3",null,{"$f":"NA()","v":{"$error":"#N/A"}},0,0,null,0,0]
[null,"Divert runon, ditch mat'l A",null,"m3",null,{"$f":"NA()","v":{"$error":"#N/A"}},0,0,null,0,0]
[null,"Divert runon, ditch mat'l B",null,"m3",null,{"$f":"NA()","v":{"$error":"#N/A"}},0,0,null,0,0]
{"$rows_left_out":61}
{"sheet":"Chemicals","index":4,"n_rows":56,"n_cols":13,"rows_kept":56,"cut":false,"hidden":false,"merged":[[2,1,2,7]]}
[1,"Chemicals/Soil Area Name:"]
[]
[null,"Note:         The procedures, equipment and packaging for clean up and removal of chemicals or contaminated soils are highly dependent on the nature of the chemicals and their existing state of containment. Government guidelines should be consulted on an individual chemical basis.  Any estimate made here should be considered very rough unless specific evaluations have been conducted."]
[null,"ACTIVITY/MATERIAL","Notes","Units","Quantity","Cost Code","Unit Cost","Cost","% Land","Land Cost","Water Cost"]
[null,"HAZARDOUS MATERIALS AUDIT"]
[null,"Hazardous materials audit",null,"allow",null,{"$f":"NA()","v":{"$error":"#N/A"}},0,{"$f":"G6*E6","v":0},0,{"$f":"H6*I6","v":0},{"$f":"+H6*(1-I6)","v":0}]
[null,"BUILDING DECONTAMINATION & CONSOLIDATION OF HAZARDOUS MATERIALS"]
[null,"Environmental technician/coordinator",null,"mandays",null,{"$f":"NA()","v":{"$error":"#N/A"}},{"$f":"IF(ISNA(F8),0,INDEX(IF(UPPER(RIGHT(F8,1))=Low,UnitCostLow, IF(UPPER(RIGHT(F8,1))=High,UnitCostHigh,UnitCostSpecified)),MATCH(UPPER(LEFT(F8,LEN(F8)-1)),CostCode,0)))","v":0},{"$f":"G8*E8","v":0},null,{"$f":"H8*I8","v":0},{"$f":"+H8*(1-I8)","v":0}]
{"$rows_left_out":49}
{"sheet":"Bldgs & Equip","index":5,"n_rows":94,"n_cols":13,"rows_kept":94,"cut":false,"hidden":false,"merged":[[11,1,12,1],[13,1,14,1],[15,1,16,1],[17,1,18,1]]}
[1,"Building / Equip Name:","Mine Site",null,null,null,"Bldg / Equip #:",1]
[]
[null,"ACTIVITY/MATERIAL","Notes","Units","Quantity","Cost Code","Unit Cost","Cost","% Land","Land Cost","Water Cost"]
[null,"DISPOSE MOBILE EQUIPMENT - Unit Costs includes disassembly and decontamination required for on-site disposal, load and transport to landfill"]
[null,"Light Mobile Equipment","Equipment quanties updated to reflect BIMC Nov. 24 EBS revisions. Includes forklifts, picks up, vehicles around five (5) tonnes and under, scissor lift, man lifts, and small garbage bins (Ref 1, pg 24-25). 2017 Work Plan add 6 units.\nEquipment quanties updated to reflect 2017 Work Plan addendum Table 3-5 30 units.\n2017 Actual work as outlined in Table 2-4 of 2018 Marginal Estimate\n2018 Work Plan see Table 3-2","each",{"$f":"164+253","v":417},"18MOLS",876.92,{"$f":"G5*E5","v":365675.63999999996},0.95,{"$f":"H5*I5","v":347391.85799999995},{"$f":"+H5*(1-I5)","v":18283.782000000014}]
[null,"Medium Mobile Equipment","Equipment quanties updated to reflect BIMC Nov. 24 EBS revisions.Includes vehicles around 10 tonnes, trailers, buses, tow trucks, large garbage bins and water trucks (Ref 1, pg 24-25).  2017 Work Plan add 10 units.\nEquipment quanties updated to reflect 2017 Work Plan addendum Table 3-5 40 units.\n2017 Actual work as outlined in Table 2-4 of 2018 Marginal Estimate\n2018 Work Plan see Table 3-2","each",{"$f":"147+288","v":435},"18MOMS",1378.63,{"$f":"G6*E6","v":599704.05000000005},0.98,{"$f":"H6*I6","v":587709.96900000004},{"$f":"+H6*(1-I6)","v":11994.081000000011}]
[null,"Heavy Mobile Equipment","Equipment quanties updated to reflect BIMC Nov. 24 EBS revisions.Includes vehicles over 10 tonnes, boom trucks, large front end loaders, dump trucks, graders and cranes (Ref 1, pg 24-25).  2017 Work Plan add 21 units.\nEquipment quanties updated to reflect 2017 Work Plan addendum Table 3-5 92 units.\n2017 Actual work as outlined in Table 2-4 of 2018 Marginal Estimate\n2018 Work Plan see Table 3-2","each",{"$f":"212+161","v":373},"18MOHS",2310.87,{"$f":"G7*E7","v":861954.51},0.98,844715.41980000003,{"$f":"+H7*(1-I7)","v":17239.090200000017}]
[null,"DISPOSE MECHANICAL EQUIPMENT - Unit Costs includes disassembly and decontamination required for on-site disposal, load and transport to landfill"]
{"$rows_left_out":87}
{"sheet":"Bldgs & Equip (2)","index":6,"n_rows":88,"n_cols":13,"rows_kept":88,"cut":false,"hidden":false,"merged":[]}
[1,"Building / Equip Name:","Milne Port",null,null,null,"Bldg / Equip #:",2]
[]
[null,"ACTIVITY/MATERIAL","Notes","Units","Quantity","Cost Code","Unit Cost","Cost","% Land","Land Cost","Water Cost"]
[null,"DISPOSE MOBILE EQUIPMENT - Unit Costs includes disassembly and decontamination required for on-site disposal, load and transport to landfill"]
[null,"Light Mobile Equipment","Equipment quanties updated to reflect BIMC Nov. 24 EBS revisions. Includes forklifts, picks up, vehicles around five (5) tonnes and under, scissor lift, man lifts, and small garbage bins (Ref 1, pg 24-25).  2017 Work Plan add 6 units.","each",104,"18MOLS",876.92,{"$f":"G5*E5","v":91199.679999999993},0.98,{"$f":"H5*I5","v":89375.686399999991},{"$f":"+H5*(1-I5)","v":1823.9936000000014}]
[null,"Medium Mobile Equipment","Includes vehicles around 10 tonnes, trailers, buses, tow trucks, large garbage bins and water trucks (Ref 1, pg 24-25). ","each",48,"18MOMS",1378.63,{"$f":"G6*E6","v":66174.240000000005},0.95,{"$f":"H6*I6","v":62865.527999999998},{"$f":"+H6*(1-I6)","v":3308.7120000000032}]
[null,"Heavy Mobile Equipment","Equipment quanties updated to reflect BIMC Nov. 24 EBS revisions. Includes vehicles over 10 tonnes, boom trucks, large front end loaders, dump trucks, graders and cranes (Ref 1, pg 24-25). 2017 Work Plan add 4 units.","each",63,"18MOHS",2310.87,{"$f":"G7*E7","v":145584.81},1,145584.81,{"$f":"+H7*(1-I7)","v":0}]
[null,"Other (reclaim conveyor)","Equipment quanties updated to reflect BIMC Nov. 24 EBS revisions. Conveyors have been classified as large mobile equipment, with the exception of the reclaim conveyor (850m in length). (Ref 1, pg 40). For 2017 Work Plan add 0.1667 units for for cross conveyor which is 1/6th of Reclaim Conveyor length.\n2017 Work Plan Addendum this work was removed","each",1.1667000000000001,"18MORS",1136232.9099999999,{"$f":"G8*E8","v":1325642.936097},1,{"$f":"H8*I8","v":1325642.936097},{"$f":"+H8*(1-I8)","v":0},null,"NOTE THIS Additional work never happened"]
{"$rows_left_out":81}
{"sheet":"Bldgs & Equip (3)","index":7,"n_rows":96,"n_cols":11,"rows_kept":96,"cut":false,"hidden":false,"merged":[]}
[1,"Building / Equip Name:","Tote Road",null,null,null,"Bldg / Equip #:",3]
[]
[null,"ACTIVITY/MATERIAL","Notes","Units","Quantity","Cost Code","Unit Cost","Cost","% Land","Land Cost","Water Cost"]
[null,"DISPOSE MOBILE EQUIPMENT - Unit Costs includes disassembly and decontamination required for on-site disposal, load and transport to landfill"]
[null,"Light Mobile Equipment",null,"each",0,"15MOLS",941.09,{"$f":"G5*E5","v":0},0.95,{"$f":"H5*I5","v":0},{"$f":"+H5*(1-I5)","v":0}]
[null,"Medium Mobile Equipment",null,"each",0,"15MOMS",1494.13,{"$f":"G6*E6","v":0},0.98,{"$f":"H6*I6","v":0},{"$f":"+H6*(1-I6)","v":0}]
[null,"Heavy Mobile Equipment",null,"each",0,"15MOHS",2616.87,{"$f":"G7*E7","v":0},0.98,0,{"$f":"+H7*(1-I7)","v":0}]
[null,"DISPOSE MECHANICAL EQUIPMENT - Unit Costs includes disassembly and decontamination required for on-site disposal, load and transport to landfill"]
{"$rows_left_out":89}
{"sheet":"Bldgs & Equip (4)","index":8,"n_rows":96,"n_cols":11,"rows_kept":96,"cut":false,"hidden":false,"merged":[]}
[1,"Building / Equip Name:","Project Wide/Other",null,null,null,"Bldg / Equip #:",4]
[]
[null,"ACTIVITY/MATERIAL","Notes","Units","Quantity","Cost Code","Unit Cost","Cost","% Land","Land Cost","Water Cost"]
[null,"DISPOSE MOBILE EQUIPMENT - Unit Costs includes disassembly and decontamination required for on-site disposal, load and transport to landfill"]
[null,"Light Mobile Equipment",null,"each",0,"15MOLS",941.09,{"$f":"G5*E5","v":0},0.95,{"$f":"H5*I5","v":0},{"$f":"+H5*(1-I5)","v":0}]
[null,"Medium Mobile Equipment",null,"each",0,"15MOMS",1494.13,{"$f":"G6*E6","v":0},0.98,{"$f":"H6*I6","v":0},{"$f":"+H6*(1-I6)","v":0}]
[null,"Heavy Mobile Equipment",null,"each",0,"15MOHS",2616.87,{"$f":"G7*E7","v":0},0.98,0,{"$f":"+H7*(1-I7)","v":0}]
[null,"DISPOSE MECHANICAL EQUIPMENT - Unit Costs includes disassembly and decontamination required for on-site disposal, load and transport to landfill"]
{"$rows_left_out":89}
{"sheet":"Water Management","index":9,"n_rows":57,"n_cols":8,"rows_kept":57,"cut":false,"hidden":false,"merged":[]}
[1,"Capital Expenditures and Short Term Water Treatment identified in 'Instructions' worksheet"]
[]
[null,"ACTIVITY/MATERIAL","Notes","Units","Quantity","Cost Code","Unit Cost","Cost"]
[null,"BREACH DYKE EMBANKMENT"]
[null,"Remove fill",null,"m3",null,"sc3l",{"$f":"IF(ISNA(F5),0,INDEX(IF(UPPER(RIGHT(F5,1))=Low,UnitCostLow, IF(UPPER(RIGHT(F5,1))=High,UnitCostHigh,UnitCostSpecified)),MATCH(UPPER(LEFT(F5,LEN(F5)-1)),CostCode,0)))","v":8.9},{"$f":"G5*E5","v":0}]
[null,"Contour water intake area",null,"m3",null,{"$f":"NA()","v":{"$error":"#N/A"}},{"$f":"IF(ISNA(F6),0,INDEX(IF(UPPER(RIGHT(F6,1))=Low,UnitCostLow, IF(UPPER(RIGHT(F6,1))=High,UnitCostHigh,UnitCostSpecified)),MATCH(UPPER(LEFT(F6,LEN(F6)-1)),CostCode,0)))","v":0},{"$f":"G6*E6","v":0}]
[null,"STABILIZE SEDIMENT PONDS/WATER MANAGEMENT PONDS"]
[null,"Place soil cover",null,"m3",null,{"$f":"NA()","v":{"$error":"#N/A"}},{"$f":"IF(ISNA(F8),0,INDEX(IF(UPPER(RIGHT(F8,1))=Low,UnitCostLow, IF(UPPER(RIGHT(F8,1))=High,UnitCostHigh,UnitCostSpecified)),MATCH(UPPER(LEFT(F8,LEN(F8)-1)),CostCode,0)))","v":0},{"$f":"G8*E8","v":0}]
{"$rows_left_out":50}
{"sheet":"ICM","index":10,"n_rows":28,"n_cols":8,"rows_kept":28,"cut":false,"hidden":false,"merged":[]}
[1,"Interim Care and Maintenance (18 Month duration)"]
[]
[null,"ACTIVITY/MATERIAL","Notes","Units","Quantity","Cost Code","Unit Cost","Cost"]
[null,"INTERIM CARE & MAINTENANCE"]
[null,"on-site caretaker","Three caretakers for 18 months (assume 2 at 3w/1w and 1 at 2w/2w rotation). Assume 36 days of travel for each caretaker over 18-months.10-hr days.","hr",11160,"15BLS",100,{"$f":"G5*E5","v":1116000}]
[null,"extra personnel","Assume crew of 15 people for 56, 10-hr days, to stabalize site and equipment at both the Mine Site, and Milne Port. Blended unit rate is used to allow for different skill levels that would make up the crew.","hr",8400,"15BLS",100,840000]
[null,"    -electrician",null,"manmonths",0,"elech",{"$f":"IF(ISNA(F7),0,INDEX(IF(UPPER(RIGHT(F7,1))=Low,UnitCostLow, IF(UPPER(RIGHT(F7,1))=High,UnitCostHigh,UnitCostSpecified)),MATCH(UPPER(LEFT(F7,LEN(F7)-1)),CostCode,0)))","v":95},{"$f":"G7*E7","v":0}]
[null,"    -mechanic",null,"manmonths",0,"mechh",{"$f":"IF(ISNA(F8),0,INDEX(IF(UPPER(RIGHT(F8,1))=Low,UnitCostLow, IF(UPPER(RIGHT(F8,1))=High,UnitCostHigh,UnitCostSpecified)),MATCH(UPPER(LEFT(F8,LEN(F8)-1)),CostCode,0)))","v":72.849999999999994},{"$f":"G8*E8","v":0}]
{"$rows_left_out":21}
{"sheet":"PostClosure","index":11,"n_rows":37,"n_cols":8,"rows_kept":37,"cut":false,"hidden":false,"merged":[]}
[1,"Post-Closure Monitoring &  Maintenance:"]
[]
[null,"ACTIVITY/MATERIAL","Notes","Units","Quantity","Cost Code","Unit Cost","Cost"]
[null,"MONITORING & INSPECTIONS"]
[null,"Annual geotechnical inspection","Assume 2 geotech inspections are specified at year 4 and  8 (Ref 2, pg 81).","each",2,"15GTS",20000,{"$f":"G5*E5","v":40000}]
[null,"Survey inspection",null,"each",null,{"$f":"NA()","v":{"$error":"#N/A"}},{"$f":"IF(ISNA(F6),0,INDEX(IF(UPPER(RIGHT(F6,1))=Low,UnitCostLow, IF(UPPER(RIGHT(F6,1))=High,UnitCostHigh,UnitCostSpecified)),MATCH(UPPER(LEFT(F6,LEN(F6)-1)),CostCode,0)))","v":0},0]
[null,"Regulatory costs*","Annual reporting over 8 years.  Unit rate from RECLAIM.","each",8,"RPTL",10000,{"$f":"G7*E7","v":80000}]
[null,"Site water monitoring (AEMP and SNP)","Two sampling events per year for 8 years, at 20 sample locations.","each",16,"15MCWL",30000,480000]
{"$rows_left_out":30}
{"sheet":"Mobilization","index":12,"n_rows":86,"n_cols":8,"rows_kept":86,"cut":false,"hidden":false,"merged":[[79,2,80,2],[62,2,66,2]]}
[1,"Mobilization/Demobilization:"]
[]
[null,"ACTIVITY/MATERIAL","Notes","Units","Quantity","Cost Code","Unit Cost","Cost"]
[null,"MOBILIZE HEAVY EQUIPMENT"]
[null,"Excavators",null,"km",null,{"$f":"NA()","v":{"$error":"#N/A"}},{"$f":"IF(ISNA(F5),0,INDEX(IF(UPPER(RIGHT(F5,1))=Low,UnitCostLow, IF(UPPER(RIGHT(F5,1))=High,UnitCostHigh,UnitCostSpecified)),MATCH(UPPER(LEFT(F5,LEN(F5)-1)),CostCode,0)))","v":0},{"$f":"G5*E5","v":0}]
[null,"Dump trucks",null,"km",null,{"$f":"NA()","v":{"$error":"#N/A"}},0,0]
[null,"Dozers",null,"km",null,{"$f":"NA()","v":{"$error":"#N/A"}},0,0]
[null,"Demolition shears",null,"km",null,{"$f":"NA()","v":{"$error":"#N/A"}},0,0]
{"$rows_left_out":79}
{"sheet":"UG Mine","index":13,"n_rows":43,"n_cols":11,"rows_kept":43,"cut":false,"hidden":false,"merged":[]}
[1,"Underground Mine Name",null,null,null,null,"UG Mine #",1]
[]
[null,"ACTIVITY/MATERIAL","Notes","Unit","Qty","Cost Code","Unit Cost","Cost","% Land","Land Cost","Water Cost"]
[null,"CONTROL ACCESS"]
[null,"Fence",null,"m",null,{"$f":"NA()","v":{"$error":"#N/A"}},{"$f":"IF(ISNA(F5),0,INDEX(IF(UPPER(RIGHT(F5,1))=Low,UnitCostLow, IF(UPPER(RIGHT(F5,1))=High,UnitCostHigh,UnitCostSpecified)),MATCH(UPPER(LEFT(F5,LEN(F5)-1)),CostCode,0)))","v":0},{"$f":"G5*E5","v":0},null,{"$f":"H5*I5","v":0},{"$f":"H5*(1-I5)","v":0}]
[null,"Signs",null,"each",null,{"$f":"NA()","v":{"$error":"#N/A"}},0,0,null,{"$f":"H6*I6","v":0},{"$f":"H6*(1-I6)","v":0}]
[null,"Block roads",null,"m3",null,{"$f":"NA()","v":{"$error":"#N/A"}},0,{"$f":"G7*E7","v":0},null,0,0]
[null,"Berm",null,"m3",null,{"$f":"NA()","v":{"$error":"#N/A"}},0,0,null,0,0]
{"$rows_left_out":36}
{"sheet":"Tailings","index":14,"n_rows":80,"n_cols":11,"rows_kept":80,"cut":false,"hidden":false,"merged":[]}
[1,"Tailings Impoundment Name:",null,null,null,null,"Pond #",1]
[]
[null,"ACTIVITY/MATERIAL","Notes","Units","Quantity","Cost Code","Unit Cost","Cost","% Land","Land Cost","Water Cost"]
[null,"CONTROL ACCESS"]
[null,"Fence",null,"m",null,{"$f":"NA()","v":{"$error":"#N/A"}},{"$f":"IF(ISNA(F5),0,INDEX(IF(UPPER(RIGHT(F5,1))=Low,UnitCostLow, IF(UPPER(RIGHT(F5,1))=High,UnitCostHigh,UnitCostSpecified)),MATCH(UPPER(LEFT(F5,LEN(F5)-1)),CostCode,0)))","v":0},{"$f":"G5*E5","v":0},null,{"$f":"H5*I5","v":0},{"$f":"+H5*(1-I5)","v":0}]
[null,"Signs",null,"each",null,{"$f":"NA()","v":{"$error":"#N/A"}},{"$f":"IF(ISNA(F6),0,INDEX(IF(UPPER(RIGHT(F6,1))=Low,UnitCostLow, IF(UPPER(RIGHT(F6,1))=High,UnitCostHigh,UnitCostSpecified)),MATCH(UPPER(LEFT(F6,LEN(F6)-1)),CostCode,0)))","v":0},{"$f":"G6*E6","v":0},null,{"$f":"H6*I6","v":0},{"$f":"+H6*(1-I6)","v":0}]
[null,"Berm",null,"m3",null,{"$f":"NA()","v":{"$error":"#N/A"}},{"$f":"IF(ISNA(F7),0,INDEX(IF(UPPER(RIGHT(F7,1))=Low,UnitCostLow, IF(UPPER(RIGHT(F7,1))=High,UnitCostHigh,UnitCostSpecified)),MATCH(UPPER(LEFT(F7,LEN(F7)-1)),CostCode,0)))","v":0},{"$f":"G7*E7","v":0},null,0,0]
[null,"Block roads",null,"m3",null,{"$f":"NA()","v":{"$error":"#N/A"}},{"$f":"IF(ISNA(F8),0,INDEX(IF(UPPER(RIGHT(F8,1))=Low,UnitCostLow, IF(UPPER(RIGHT(F8,1))=High,UnitCostHigh,UnitCostSpecified)),MATCH(UPPER(LEFT(F8,LEN(F8)-1)),CostCode,0)))","v":0},{"$f":"G8*E8","v":0},null,0,0]
{"$rows_left_out":73}
{"sheet":"Water Treatment","index":15,"n_rows":39,"n_cols":8,"rows_kept":39,"cut":false,"hidden":false,"merged":[]}
[1,"Post Closure Water Treatment - Identified as long term/post-closure in 'Instructions' worksheet"]
[]
[null,"ACTIVITY/MATERIAL","Notes","Units","Quantity","Cost Code","Unit Cost","Cost"]
[null,"ADDITION OF REAGENTS TO WTP"]
[null,"H2O2",null,"kg",null,{"$f":"NA()","v":{"$error":"#N/A"}},{"$f":"IF(ISNA(F5),0,INDEX(IF(UPPER(RIGHT(F5,1))=Low,UnitCostLow, IF(UPPER(RIGHT(F5,1))=High,UnitCostHigh,UnitCostSpecified)),MATCH(UPPER(LEFT(F5,LEN(F5)-1)),CostCode,0)))","v":0},{"$f":"G5*E5","v":0}]
[null,"lime",null,"kg",null,{"$f":"NA()","v":{"$error":"#N/A"}},0,0]
[null,"ferric sulphate",null,"kg",null,{"$f":"NA()","v":{"$error":"#N/A"}},0,0]
[null,"ferrous sulphate",null,"kg",null,{"$f":"NA()","v":{"$error":"#N/A"}},0,0]
{"$rows_left_out":32}
{"sheet":"Unit_Costs","index":16,"n_rows":296,"n_cols":12,"rows_kept":296,"cut":false,"hidden":false,"merged":[]}
["Unit Cost Table (for refining unit costs see \"Estimator\" worksheet)"]
[null,null,null,"Filter by unit",null,"",""]
[null,null,null,null,null,"","",""]
["ITEM","Detail",null,"COST CODE","UNITS","LOW $","HIGH $","SPECIFIED $",null,"COMMENTS"]
[null,null,null,null,null,"","",""]
["Accomodation"]
[null,null,null,"ACCM","manday",100,175]
["Buildings - Decontaminate",null,null,null,null,"","",""]
{"$rows_left_out":289}
{"sheet":"Estimator","index":17,"n_rows":55,"n_cols":15,"rows_kept":55,"cut":false,"hidden":false,"merged":[]}
[null,"Unit Cost Estimator",null,1,"Equipment Productivity Figures and Graphs have been reproduced from Caterpillar Performance Handbook - Edition 42 "]
[null,"EXCAVATION",null,null,null,null,"HAUL AND DUMPING",null,null,null,null,"SPREADING/DOZING"]
[null,"Productivity",null,null,null,null,"Productivity",null,null,null,null,"Productivity"]
[null,"Machine","Cat 336EL",null,null,null,"Machine","Cat 770",null,null,null,"Machine","Cat D8"]
[null,"bucket capacity",null,3.16,"m3",null,"truck capacity",null,25.1,"m3",null,"Estimate production using example curves provided or ",null,600,"m3/hr"]
[null,"fill factor",null,0.75,"%",null,"fill factor",null,0.8,"%",null,"equivalent from other supplier"]
[null,"cycle time",null,45,"seconds",null,null,null,null,null,null,"Correction factors (see table provided)"]
[null,"operator skill",null,0.8,"%",null,"load time",null,6,"min.",null,"      operator skill",null,0.75]
{"$rows_left_out":48}
{"sheet":"Tools","index":18,"n_rows":12,"n_cols":12,"rows_kept":12,"cut":false,"hidden":false,"merged":[]}
["The functions in this worksheet serve as a back up in the event that the menu item \"Add-Ins\" is not shown in Excel menu bar"]
[]
[]
[null,null,"Save file before clearing all data"]
[]
[null,null,null,null,null,null,null,null,null,null,null,"These functions duplicate components within worksheet"]
[]
[]
{"$rows_left_out":4}